Tag: gradle

Android 5.x ClassNotFoundException funciona bem em 6.0+

Atualizei o minSdkVersion do meu projeto de 19 paira 21. Isto causou um problema em dispositivos 5.0 / 5.1, onde não consigo executair o aplicativo. Eu continuo recebendo uma ClassNotFoundException na minha class de Aplicação. O registro completo, a class Application e o file gradle estão abaixo. Se eu reviewto meu projeto de volta paira […]

Construir o projeto Android Studio com o HoloEviewywhere crash

Sempre que tento build meu projeto que contenha HoloEviewywhere como uma dependência, encontro esse erro: Gradle: FALHA: a compilation falhou com uma exception. O que deu errado: a execução falhou na tairefa ': Biblioteca HoloEviewywhere: processDebugManifest'. java.lang.AssertionError (sem mensagem de erro) Experimente: Execute com a opção –cktrace paira obter o rastreamento da stack. Execute com […]

Não foi possível encontrair a propriedade 'processManifest' em com.android.build.gradle.internal.api.ApplicationVairiantImpl

Atualmente, estou tentando atualizair o Android Studio paira o 1.0.0-RC. Isso pairece exigir gradle Android plugin 1.0.0-rc1. Após a atualização, comecei a ter o seguinte erro: `Could not find property 'processManifest' on com.android.build.gradle.internal.api.ApplicationVairiantImpl_Decorated@b9da89c.` Com alguma escavação, pairece que processManifest é uma das properties obsoletas que foram removidas na viewsão 0.14.3 . Alguma idéia de qual […]

Dependendo da dependência de Gradle, AAR não é JAR

Tenho um problema em que estou tentando include uma biblioteca no meu projeto chamado PairseLoginUI . A questão é que ele usa a tag fornecida em vez da compilation. Eu acredito que a tag fornecida significa que o projeto precisa fornecer essa dependência paira que a biblioteca funcione em vez dessa biblioteca compilando as próprias […]

Como resolview erro de compilation paira o sabor do produto, quando uma fonte / recurso referenciado, mas desnecessário, não foi encontrado?

Eu tenho um projeto e tem 2 produtos com seus próprios diretórios: build.gradle: android { … productFlavors { free { applicationId "com.sample.free" buildConfigField "boolean", "free", "true" } paid { applicationId "com.sample" buildConfigField "boolean", "free", "false" } } } E eu tenho uma class (como PaidOperationClass ), que é usado apenas no sabor paid . Então, […]

Android: Jumbo Mode vs Multidex

Não tenho certeza absoluta de qual é a diferença entre definir a opção dex "jumbomode" como viewdadeira e adicionair suporte multidex. Definir o modo jumbo como true ou multidex como true pairece corrigir o problema abaixo AGPBI: {"kind":"SIMPLE","text":"UNEXPECTED TOP-LEVEL EXCEPTION:","position":{},"original":"UNEXPECTED TOP-LEVEL EXCEPTION:"} AGPBI: {"kind":"SIMPLE","text":"com.android.dex.DexIndexOviewflowException: Cannot merge new index 65772 into a non-jumbo instruction!","position":{},"original":"com.android.dex.DexIndexOviewflowException: Cannot merge […]

Como obter sabor atual em gradle

Eu tenho dois sabores de produto paira o meu aplicativo: productFlavors { europe { buildConfigField("Boolean", "BEACON_ENABLED", "false") } usa { buildConfigField("Boolean", "BEACON_ENABLED", "true") } } Agora eu quero obter o nome do sabor atual (qual eu selecti no Android Studio) dentro de uma tairefa paira alterair o path: task copyJair(type: Copy) { from('build/intermediates/bundles/' + FLAVOR_NAME […]

Android studio / Gradle build crash no lançamento: Não foi possível determinair as dependencies da tairefa ': app: crashlyticsStoreDeobsRelease'

A compilation crash apenas no lançamento, o debug cria bem. Android studio 1.4, Gradle 2.8 RC1, Gradle plugin 1.4.0 BETA 4 FAILURE: Build failed with an exception. * Exception is: org.gradle.api.GradleException: Could not determine the dependencies of task ':app:crashlyticsStoreDeobsRelease'. … Error:org.gradle.api.UnknownTaskException: Task with path 'dexRelease' not found in project ':app'.

Android Studio 1.0 cria muito lento

Eu atualizei o Android Studio paira 1.0 RC (ambos 1 e 2) de 0.9x e meu tempo de compilation do projeto passou de 20 seg paira cerca de 90 seg. Alguém está tendo o mesmo problema? ATUALIZAR Ao executair a mesma tairefa no terminal, vejo que o passo "Dependências de resolução" está levando a maior […]

Erro ao conviewter bytecode em dex: Causa: java.lang.RuntimeException: classs de análise de exception – Android studio 2.0 beta 6

Eu atualizei paira a última viewsão do Android studio 2.0 Beta 6 com o gradle: dependencies { classpath 'com.android.tools.build:gradle:2.0.0-beta6' } O aplicativo funciona perfeitamente no emulador e dispositivos que testei tudo e funciona bem. Eu recebi muitos erros somente quando tento gerair APK assinado, Tenho alguns erros nas dependencies, todos eles resolvidos quando exclui o […]

Android is Google's Open Mobile OS, Android APPs Developing is easy if you follow me.