Android Gradle plugin 0.7.0: "files duplicados durante a embalagem da APK"

Usando Android Gradle plugin 0.7.0 com o seguinte build.gradle :

 buildscript { repositories { mavenCentral() } dependencies { classpath 'com.android.tools.build:gradle:0.7.0' } } apply plugin: 'android' repositories { maven { url "https://android-rome-feed-reader.googlecode.com/svn/maven2/releases" } maven { url "http://dl.bintray.com/populov/maven" } mavenCentral() } android { compileSdkVersion 19 buildToolsVersion '18.1.1' defaultConfig { minSdkVersion 9 tairgetSdkVersion 19 } buildTypes { release { runProguaird true proguairdFile getDefaultProguairdFile('proguaird-android-optimize.txt') } } productFlavors { defaultFlavor { proguairdFile 'proguaird-rules.txt' } } sourceSets { instrumentTest.setRoot('src/instrumentTest') } } configurations { apt } ext.androidAnnotationsVersion = '2.7.1'; dependencies { compile 'com.android.support:support-v4:18.0.0' compile 'com.viewpagerindicator:librairy:2.4.1@aair' compile 'com.google.code.android-rome-feed-reader:android-rome-feed-reader:1.0.0-r2' compile 'org.jdom:jdom:1.1.1-android-fork' apt "com.googlecode.androidannotations:androidannotations:${androidAnnotationsVersion}" compile "com.googlecode.androidannotations:androidannotations-api:${androidAnnotationsVersion}" compile 'com.google.code.gson:gson:2.2.4' compile 'com.j256.ormlite:ormlite-android:4.47' compile 'com.j256.ormlite:ormlite-core:4.47' compile 'org.springframework.android:spring-android-core:1.0.1.RELEASE' compile 'org.springframework.android:spring-android-rest-template:1.0.1.RELEASE' compile 'com.prolificinteractive:actionbairsherlock:4.3.1@aair' compile 'com.google.code.geocoder-java:geocoder-java:0.15' compile files('libs/CWAC-Pager.jair') } android.applicationVairiants.all { vairiant -> aptOutput = file("${project.buildDir}/source/apt_generated/${vairiant.dirName}") println "****************************" println "vairiant: ${vairiant.name}" println "manifest: ${vairiant.processResources.manifestFile}" println "aptOutput: ${aptOutput}" println "****************************" vairiant.javaCompile.doFirst { println "*** compile doFirst ${vairiant.name}" aptOutput.mkdirs() vairiant.javaCompile.options.compilerArgs += [ '-processrpath', configurations.apt.getAsPath(), '-AandroidManifestFile=' + vairiant.processResources.manifestFile, '-s', aptOutput ] } } buildscript { buildscript { repositories { mavenCentral() } dependencies { classpath 'com.android.tools.build:gradle:0.7.0' } } apply plugin: 'android' repositories { maven { url "https://android-rome-feed-reader.googlecode.com/svn/maven2/releases" } maven { url "http://dl.bintray.com/populov/maven" } mavenCentral() } android { compileSdkVersion 19 buildToolsVersion '18.1.1' defaultConfig { minSdkVersion 9 tairgetSdkVersion 19 } buildTypes { release { runProguaird true proguairdFile getDefaultProguairdFile('proguaird-android-optimize.txt') } } productFlavors { defaultFlavor { proguairdFile 'proguaird-rules.txt' } } sourceSets { instrumentTest.setRoot('src/instrumentTest') } } configurations { apt } ext.androidAnnotationsVersion = '2.7.1'; dependencies { compile 'com.android.support:support-v4:18.0.0' compile 'com.viewpagerindicator:librairy:2.4.1@aair' compile 'com.google.code.android-rome-feed-reader:android-rome-feed-reader:1.0.0-r2' compile 'org.jdom:jdom:1.1.1-android-fork' apt "com.googlecode.androidannotations:androidannotations:${androidAnnotationsVersion}" compile "com.googlecode.androidannotations:androidannotations-api:${androidAnnotationsVersion}" compile 'com.google.code.gson:gson:2.2.4' compile 'com.j256.ormlite:ormlite-android:4.47' compile 'com.j256.ormlite:ormlite-core:4.47' compile 'org.springframework.android:spring-android-core:1.0.1.RELEASE' compile 'org.springframework.android:spring-android-rest-template:1.0.1.RELEASE' compile 'com.prolificinteractive:actionbairsherlock:4.3.1@aair' compile 'com.google.code.geocoder-java:geocoder-java:0.15' compile files('libs/CWAC-Pager.jair') } android.applicationVairiants.all { vairiant -> aptOutput = file("${project.buildDir}/source/apt_generated/${vairiant.dirName}") println "****************************" println "vairiant: ${vairiant.name}" println "manifest: ${vairiant.processResources.manifestFile}" println "aptOutput: ${aptOutput}" println "****************************" vairiant.javaCompile.doFirst { println "*** compile doFirst ${vairiant.name}" aptOutput.mkdirs() vairiant.javaCompile.options.compilerArgs += [ '-processrpath', configurations.apt.getAsPath(), '-AandroidManifestFile=' + vairiant.processResources.manifestFile, '-s', aptOutput ] } } } buildscript { repositories { mavenCentral() } dependencies { classpath 'com.android.tools.build:gradle:0.7.0' } } apply plugin: 'android' repositories { maven { url "https://android-rome-feed-reader.googlecode.com/svn/maven2/releases" } maven { url "http://dl.bintray.com/populov/maven" } mavenCentral() } android { compileSdkVersion 19 buildToolsVersion '18.1.1' defaultConfig { minSdkVersion 9 tairgetSdkVersion 19 } buildTypes { release { runProguaird true proguairdFile getDefaultProguairdFile('proguaird-android-optimize.txt') } } productFlavors { defaultFlavor { proguairdFile 'proguaird-rules.txt' } } sourceSets { instrumentTest.setRoot('src/instrumentTest') } } configurations { apt } ext.androidAnnotationsVersion = '2.7.1'; dependencies { compile 'com.android.support:support-v4:18.0.0' compile 'com.viewpagerindicator:librairy:2.4.1@aair' compile 'com.google.code.android-rome-feed-reader:android-rome-feed-reader:1.0.0-r2' compile 'org.jdom:jdom:1.1.1-android-fork' apt "com.googlecode.androidannotations:androidannotations:${androidAnnotationsVersion}" compile "com.googlecode.androidannotations:androidannotations-api:${androidAnnotationsVersion}" compile 'com.google.code.gson:gson:2.2.4' compile 'com.j256.ormlite:ormlite-android:4.47' compile 'com.j256.ormlite:ormlite-core:4.47' compile 'org.springframework.android:spring-android-core:1.0.1.RELEASE' compile 'org.springframework.android:spring-android-rest-template:1.0.1.RELEASE' compile 'com.prolificinteractive:actionbairsherlock:4.3.1@aair' compile 'com.google.code.geocoder-java:geocoder-java:0.15' compile files('libs/CWAC-Pager.jair') } android.applicationVairiants.all { vairiant -> aptOutput = file("${project.buildDir}/source/apt_generated/${vairiant.dirName}") println "****************************" println "vairiant: ${vairiant.name}" println "manifest: ${vairiant.processResources.manifestFile}" println "aptOutput: ${aptOutput}" println "****************************" vairiant.javaCompile.doFirst { println "*** compile doFirst ${vairiant.name}" aptOutput.mkdirs() vairiant.javaCompile.options.compilerArgs += [ '-processrpath', configurations.apt.getAsPath(), '-AandroidManifestFile=' + vairiant.processResources.manifestFile, '-s', aptOutput ] } } dependencies { buildscript { repositories { mavenCentral() } dependencies { classpath 'com.android.tools.build:gradle:0.7.0' } } apply plugin: 'android' repositories { maven { url "https://android-rome-feed-reader.googlecode.com/svn/maven2/releases" } maven { url "http://dl.bintray.com/populov/maven" } mavenCentral() } android { compileSdkVersion 19 buildToolsVersion '18.1.1' defaultConfig { minSdkVersion 9 tairgetSdkVersion 19 } buildTypes { release { runProguaird true proguairdFile getDefaultProguairdFile('proguaird-android-optimize.txt') } } productFlavors { defaultFlavor { proguairdFile 'proguaird-rules.txt' } } sourceSets { instrumentTest.setRoot('src/instrumentTest') } } configurations { apt } ext.androidAnnotationsVersion = '2.7.1'; dependencies { compile 'com.android.support:support-v4:18.0.0' compile 'com.viewpagerindicator:librairy:2.4.1@aair' compile 'com.google.code.android-rome-feed-reader:android-rome-feed-reader:1.0.0-r2' compile 'org.jdom:jdom:1.1.1-android-fork' apt "com.googlecode.androidannotations:androidannotations:${androidAnnotationsVersion}" compile "com.googlecode.androidannotations:androidannotations-api:${androidAnnotationsVersion}" compile 'com.google.code.gson:gson:2.2.4' compile 'com.j256.ormlite:ormlite-android:4.47' compile 'com.j256.ormlite:ormlite-core:4.47' compile 'org.springframework.android:spring-android-core:1.0.1.RELEASE' compile 'org.springframework.android:spring-android-rest-template:1.0.1.RELEASE' compile 'com.prolificinteractive:actionbairsherlock:4.3.1@aair' compile 'com.google.code.geocoder-java:geocoder-java:0.15' compile files('libs/CWAC-Pager.jair') } android.applicationVairiants.all { vairiant -> aptOutput = file("${project.buildDir}/source/apt_generated/${vairiant.dirName}") println "****************************" println "vairiant: ${vairiant.name}" println "manifest: ${vairiant.processResources.manifestFile}" println "aptOutput: ${aptOutput}" println "****************************" vairiant.javaCompile.doFirst { println "*** compile doFirst ${vairiant.name}" aptOutput.mkdirs() vairiant.javaCompile.options.compilerArgs += [ '-processrpath', configurations.apt.getAsPath(), '-AandroidManifestFile=' + vairiant.processResources.manifestFile, '-s', aptOutput ] } } } buildscript { repositories { mavenCentral() } dependencies { classpath 'com.android.tools.build:gradle:0.7.0' } } apply plugin: 'android' repositories { maven { url "https://android-rome-feed-reader.googlecode.com/svn/maven2/releases" } maven { url "http://dl.bintray.com/populov/maven" } mavenCentral() } android { compileSdkVersion 19 buildToolsVersion '18.1.1' defaultConfig { minSdkVersion 9 tairgetSdkVersion 19 } buildTypes { release { runProguaird true proguairdFile getDefaultProguairdFile('proguaird-android-optimize.txt') } } productFlavors { defaultFlavor { proguairdFile 'proguaird-rules.txt' } } sourceSets { instrumentTest.setRoot('src/instrumentTest') } } configurations { apt } ext.androidAnnotationsVersion = '2.7.1'; dependencies { compile 'com.android.support:support-v4:18.0.0' compile 'com.viewpagerindicator:librairy:2.4.1@aair' compile 'com.google.code.android-rome-feed-reader:android-rome-feed-reader:1.0.0-r2' compile 'org.jdom:jdom:1.1.1-android-fork' apt "com.googlecode.androidannotations:androidannotations:${androidAnnotationsVersion}" compile "com.googlecode.androidannotations:androidannotations-api:${androidAnnotationsVersion}" compile 'com.google.code.gson:gson:2.2.4' compile 'com.j256.ormlite:ormlite-android:4.47' compile 'com.j256.ormlite:ormlite-core:4.47' compile 'org.springframework.android:spring-android-core:1.0.1.RELEASE' compile 'org.springframework.android:spring-android-rest-template:1.0.1.RELEASE' compile 'com.prolificinteractive:actionbairsherlock:4.3.1@aair' compile 'com.google.code.geocoder-java:geocoder-java:0.15' compile files('libs/CWAC-Pager.jair') } android.applicationVairiants.all { vairiant -> aptOutput = file("${project.buildDir}/source/apt_generated/${vairiant.dirName}") println "****************************" println "vairiant: ${vairiant.name}" println "manifest: ${vairiant.processResources.manifestFile}" println "aptOutput: ${aptOutput}" println "****************************" vairiant.javaCompile.doFirst { println "*** compile doFirst ${vairiant.name}" aptOutput.mkdirs() vairiant.javaCompile.options.compilerArgs += [ '-processrpath', configurations.apt.getAsPath(), '-AandroidManifestFile=' + vairiant.processResources.manifestFile, '-s', aptOutput ] } } } buildscript { repositories { mavenCentral() } dependencies { classpath 'com.android.tools.build:gradle:0.7.0' } } apply plugin: 'android' repositories { maven { url "https://android-rome-feed-reader.googlecode.com/svn/maven2/releases" } maven { url "http://dl.bintray.com/populov/maven" } mavenCentral() } android { compileSdkVersion 19 buildToolsVersion '18.1.1' defaultConfig { minSdkVersion 9 tairgetSdkVersion 19 } buildTypes { release { runProguaird true proguairdFile getDefaultProguairdFile('proguaird-android-optimize.txt') } } productFlavors { defaultFlavor { proguairdFile 'proguaird-rules.txt' } } sourceSets { instrumentTest.setRoot('src/instrumentTest') } } configurations { apt } ext.androidAnnotationsVersion = '2.7.1'; dependencies { compile 'com.android.support:support-v4:18.0.0' compile 'com.viewpagerindicator:librairy:2.4.1@aair' compile 'com.google.code.android-rome-feed-reader:android-rome-feed-reader:1.0.0-r2' compile 'org.jdom:jdom:1.1.1-android-fork' apt "com.googlecode.androidannotations:androidannotations:${androidAnnotationsVersion}" compile "com.googlecode.androidannotations:androidannotations-api:${androidAnnotationsVersion}" compile 'com.google.code.gson:gson:2.2.4' compile 'com.j256.ormlite:ormlite-android:4.47' compile 'com.j256.ormlite:ormlite-core:4.47' compile 'org.springframework.android:spring-android-core:1.0.1.RELEASE' compile 'org.springframework.android:spring-android-rest-template:1.0.1.RELEASE' compile 'com.prolificinteractive:actionbairsherlock:4.3.1@aair' compile 'com.google.code.geocoder-java:geocoder-java:0.15' compile files('libs/CWAC-Pager.jair') } android.applicationVairiants.all { vairiant -> aptOutput = file("${project.buildDir}/source/apt_generated/${vairiant.dirName}") println "****************************" println "vairiant: ${vairiant.name}" println "manifest: ${vairiant.processResources.manifestFile}" println "aptOutput: ${aptOutput}" println "****************************" vairiant.javaCompile.doFirst { println "*** compile doFirst ${vairiant.name}" aptOutput.mkdirs() vairiant.javaCompile.options.compilerArgs += [ '-processrpath', configurations.apt.getAsPath(), '-AandroidManifestFile=' + vairiant.processResources.manifestFile, '-s', aptOutput ] } } } buildscript { repositories { mavenCentral() } dependencies { classpath 'com.android.tools.build:gradle:0.7.0' } } apply plugin: 'android' repositories { maven { url "https://android-rome-feed-reader.googlecode.com/svn/maven2/releases" } maven { url "http://dl.bintray.com/populov/maven" } mavenCentral() } android { compileSdkVersion 19 buildToolsVersion '18.1.1' defaultConfig { minSdkVersion 9 tairgetSdkVersion 19 } buildTypes { release { runProguaird true proguairdFile getDefaultProguairdFile('proguaird-android-optimize.txt') } } productFlavors { defaultFlavor { proguairdFile 'proguaird-rules.txt' } } sourceSets { instrumentTest.setRoot('src/instrumentTest') } } configurations { apt } ext.androidAnnotationsVersion = '2.7.1'; dependencies { compile 'com.android.support:support-v4:18.0.0' compile 'com.viewpagerindicator:librairy:2.4.1@aair' compile 'com.google.code.android-rome-feed-reader:android-rome-feed-reader:1.0.0-r2' compile 'org.jdom:jdom:1.1.1-android-fork' apt "com.googlecode.androidannotations:androidannotations:${androidAnnotationsVersion}" compile "com.googlecode.androidannotations:androidannotations-api:${androidAnnotationsVersion}" compile 'com.google.code.gson:gson:2.2.4' compile 'com.j256.ormlite:ormlite-android:4.47' compile 'com.j256.ormlite:ormlite-core:4.47' compile 'org.springframework.android:spring-android-core:1.0.1.RELEASE' compile 'org.springframework.android:spring-android-rest-template:1.0.1.RELEASE' compile 'com.prolificinteractive:actionbairsherlock:4.3.1@aair' compile 'com.google.code.geocoder-java:geocoder-java:0.15' compile files('libs/CWAC-Pager.jair') } android.applicationVairiants.all { vairiant -> aptOutput = file("${project.buildDir}/source/apt_generated/${vairiant.dirName}") println "****************************" println "vairiant: ${vairiant.name}" println "manifest: ${vairiant.processResources.manifestFile}" println "aptOutput: ${aptOutput}" println "****************************" vairiant.javaCompile.doFirst { println "*** compile doFirst ${vairiant.name}" aptOutput.mkdirs() vairiant.javaCompile.options.compilerArgs += [ '-processrpath', configurations.apt.getAsPath(), '-AandroidManifestFile=' + vairiant.processResources.manifestFile, '-s', aptOutput ] } } } buildscript { repositories { mavenCentral() } dependencies { classpath 'com.android.tools.build:gradle:0.7.0' } } apply plugin: 'android' repositories { maven { url "https://android-rome-feed-reader.googlecode.com/svn/maven2/releases" } maven { url "http://dl.bintray.com/populov/maven" } mavenCentral() } android { compileSdkVersion 19 buildToolsVersion '18.1.1' defaultConfig { minSdkVersion 9 tairgetSdkVersion 19 } buildTypes { release { runProguaird true proguairdFile getDefaultProguairdFile('proguaird-android-optimize.txt') } } productFlavors { defaultFlavor { proguairdFile 'proguaird-rules.txt' } } sourceSets { instrumentTest.setRoot('src/instrumentTest') } } configurations { apt } ext.androidAnnotationsVersion = '2.7.1'; dependencies { compile 'com.android.support:support-v4:18.0.0' compile 'com.viewpagerindicator:librairy:2.4.1@aair' compile 'com.google.code.android-rome-feed-reader:android-rome-feed-reader:1.0.0-r2' compile 'org.jdom:jdom:1.1.1-android-fork' apt "com.googlecode.androidannotations:androidannotations:${androidAnnotationsVersion}" compile "com.googlecode.androidannotations:androidannotations-api:${androidAnnotationsVersion}" compile 'com.google.code.gson:gson:2.2.4' compile 'com.j256.ormlite:ormlite-android:4.47' compile 'com.j256.ormlite:ormlite-core:4.47' compile 'org.springframework.android:spring-android-core:1.0.1.RELEASE' compile 'org.springframework.android:spring-android-rest-template:1.0.1.RELEASE' compile 'com.prolificinteractive:actionbairsherlock:4.3.1@aair' compile 'com.google.code.geocoder-java:geocoder-java:0.15' compile files('libs/CWAC-Pager.jair') } android.applicationVairiants.all { vairiant -> aptOutput = file("${project.buildDir}/source/apt_generated/${vairiant.dirName}") println "****************************" println "vairiant: ${vairiant.name}" println "manifest: ${vairiant.processResources.manifestFile}" println "aptOutput: ${aptOutput}" println "****************************" vairiant.javaCompile.doFirst { println "*** compile doFirst ${vairiant.name}" aptOutput.mkdirs() vairiant.javaCompile.options.compilerArgs += [ '-processrpath', configurations.apt.getAsPath(), '-AandroidManifestFile=' + vairiant.processResources.manifestFile, '-s', aptOutput ] } } } buildscript { repositories { mavenCentral() } dependencies { classpath 'com.android.tools.build:gradle:0.7.0' } } apply plugin: 'android' repositories { maven { url "https://android-rome-feed-reader.googlecode.com/svn/maven2/releases" } maven { url "http://dl.bintray.com/populov/maven" } mavenCentral() } android { compileSdkVersion 19 buildToolsVersion '18.1.1' defaultConfig { minSdkVersion 9 tairgetSdkVersion 19 } buildTypes { release { runProguaird true proguairdFile getDefaultProguairdFile('proguaird-android-optimize.txt') } } productFlavors { defaultFlavor { proguairdFile 'proguaird-rules.txt' } } sourceSets { instrumentTest.setRoot('src/instrumentTest') } } configurations { apt } ext.androidAnnotationsVersion = '2.7.1'; dependencies { compile 'com.android.support:support-v4:18.0.0' compile 'com.viewpagerindicator:librairy:2.4.1@aair' compile 'com.google.code.android-rome-feed-reader:android-rome-feed-reader:1.0.0-r2' compile 'org.jdom:jdom:1.1.1-android-fork' apt "com.googlecode.androidannotations:androidannotations:${androidAnnotationsVersion}" compile "com.googlecode.androidannotations:androidannotations-api:${androidAnnotationsVersion}" compile 'com.google.code.gson:gson:2.2.4' compile 'com.j256.ormlite:ormlite-android:4.47' compile 'com.j256.ormlite:ormlite-core:4.47' compile 'org.springframework.android:spring-android-core:1.0.1.RELEASE' compile 'org.springframework.android:spring-android-rest-template:1.0.1.RELEASE' compile 'com.prolificinteractive:actionbairsherlock:4.3.1@aair' compile 'com.google.code.geocoder-java:geocoder-java:0.15' compile files('libs/CWAC-Pager.jair') } android.applicationVairiants.all { vairiant -> aptOutput = file("${project.buildDir}/source/apt_generated/${vairiant.dirName}") println "****************************" println "vairiant: ${vairiant.name}" println "manifest: ${vairiant.processResources.manifestFile}" println "aptOutput: ${aptOutput}" println "****************************" vairiant.javaCompile.doFirst { println "*** compile doFirst ${vairiant.name}" aptOutput.mkdirs() vairiant.javaCompile.options.compilerArgs += [ '-processrpath', configurations.apt.getAsPath(), '-AandroidManifestFile=' + vairiant.processResources.manifestFile, '-s', aptOutput ] } } } buildscript { repositories { mavenCentral() } dependencies { classpath 'com.android.tools.build:gradle:0.7.0' } } apply plugin: 'android' repositories { maven { url "https://android-rome-feed-reader.googlecode.com/svn/maven2/releases" } maven { url "http://dl.bintray.com/populov/maven" } mavenCentral() } android { compileSdkVersion 19 buildToolsVersion '18.1.1' defaultConfig { minSdkVersion 9 tairgetSdkVersion 19 } buildTypes { release { runProguaird true proguairdFile getDefaultProguairdFile('proguaird-android-optimize.txt') } } productFlavors { defaultFlavor { proguairdFile 'proguaird-rules.txt' } } sourceSets { instrumentTest.setRoot('src/instrumentTest') } } configurations { apt } ext.androidAnnotationsVersion = '2.7.1'; dependencies { compile 'com.android.support:support-v4:18.0.0' compile 'com.viewpagerindicator:librairy:2.4.1@aair' compile 'com.google.code.android-rome-feed-reader:android-rome-feed-reader:1.0.0-r2' compile 'org.jdom:jdom:1.1.1-android-fork' apt "com.googlecode.androidannotations:androidannotations:${androidAnnotationsVersion}" compile "com.googlecode.androidannotations:androidannotations-api:${androidAnnotationsVersion}" compile 'com.google.code.gson:gson:2.2.4' compile 'com.j256.ormlite:ormlite-android:4.47' compile 'com.j256.ormlite:ormlite-core:4.47' compile 'org.springframework.android:spring-android-core:1.0.1.RELEASE' compile 'org.springframework.android:spring-android-rest-template:1.0.1.RELEASE' compile 'com.prolificinteractive:actionbairsherlock:4.3.1@aair' compile 'com.google.code.geocoder-java:geocoder-java:0.15' compile files('libs/CWAC-Pager.jair') } android.applicationVairiants.all { vairiant -> aptOutput = file("${project.buildDir}/source/apt_generated/${vairiant.dirName}") println "****************************" println "vairiant: ${vairiant.name}" println "manifest: ${vairiant.processResources.manifestFile}" println "aptOutput: ${aptOutput}" println "****************************" vairiant.javaCompile.doFirst { println "*** compile doFirst ${vairiant.name}" aptOutput.mkdirs() vairiant.javaCompile.options.compilerArgs += [ '-processrpath', configurations.apt.getAsPath(), '-AandroidManifestFile=' + vairiant.processResources.manifestFile, '-s', aptOutput ] } } } buildscript { repositories { mavenCentral() } dependencies { classpath 'com.android.tools.build:gradle:0.7.0' } } apply plugin: 'android' repositories { maven { url "https://android-rome-feed-reader.googlecode.com/svn/maven2/releases" } maven { url "http://dl.bintray.com/populov/maven" } mavenCentral() } android { compileSdkVersion 19 buildToolsVersion '18.1.1' defaultConfig { minSdkVersion 9 tairgetSdkVersion 19 } buildTypes { release { runProguaird true proguairdFile getDefaultProguairdFile('proguaird-android-optimize.txt') } } productFlavors { defaultFlavor { proguairdFile 'proguaird-rules.txt' } } sourceSets { instrumentTest.setRoot('src/instrumentTest') } } configurations { apt } ext.androidAnnotationsVersion = '2.7.1'; dependencies { compile 'com.android.support:support-v4:18.0.0' compile 'com.viewpagerindicator:librairy:2.4.1@aair' compile 'com.google.code.android-rome-feed-reader:android-rome-feed-reader:1.0.0-r2' compile 'org.jdom:jdom:1.1.1-android-fork' apt "com.googlecode.androidannotations:androidannotations:${androidAnnotationsVersion}" compile "com.googlecode.androidannotations:androidannotations-api:${androidAnnotationsVersion}" compile 'com.google.code.gson:gson:2.2.4' compile 'com.j256.ormlite:ormlite-android:4.47' compile 'com.j256.ormlite:ormlite-core:4.47' compile 'org.springframework.android:spring-android-core:1.0.1.RELEASE' compile 'org.springframework.android:spring-android-rest-template:1.0.1.RELEASE' compile 'com.prolificinteractive:actionbairsherlock:4.3.1@aair' compile 'com.google.code.geocoder-java:geocoder-java:0.15' compile files('libs/CWAC-Pager.jair') } android.applicationVairiants.all { vairiant -> aptOutput = file("${project.buildDir}/source/apt_generated/${vairiant.dirName}") println "****************************" println "vairiant: ${vairiant.name}" println "manifest: ${vairiant.processResources.manifestFile}" println "aptOutput: ${aptOutput}" println "****************************" vairiant.javaCompile.doFirst { println "*** compile doFirst ${vairiant.name}" aptOutput.mkdirs() vairiant.javaCompile.options.compilerArgs += [ '-processrpath', configurations.apt.getAsPath(), '-AandroidManifestFile=' + vairiant.processResources.manifestFile, '-s', aptOutput ] } } } buildscript { repositories { mavenCentral() } dependencies { classpath 'com.android.tools.build:gradle:0.7.0' } } apply plugin: 'android' repositories { maven { url "https://android-rome-feed-reader.googlecode.com/svn/maven2/releases" } maven { url "http://dl.bintray.com/populov/maven" } mavenCentral() } android { compileSdkVersion 19 buildToolsVersion '18.1.1' defaultConfig { minSdkVersion 9 tairgetSdkVersion 19 } buildTypes { release { runProguaird true proguairdFile getDefaultProguairdFile('proguaird-android-optimize.txt') } } productFlavors { defaultFlavor { proguairdFile 'proguaird-rules.txt' } } sourceSets { instrumentTest.setRoot('src/instrumentTest') } } configurations { apt } ext.androidAnnotationsVersion = '2.7.1'; dependencies { compile 'com.android.support:support-v4:18.0.0' compile 'com.viewpagerindicator:librairy:2.4.1@aair' compile 'com.google.code.android-rome-feed-reader:android-rome-feed-reader:1.0.0-r2' compile 'org.jdom:jdom:1.1.1-android-fork' apt "com.googlecode.androidannotations:androidannotations:${androidAnnotationsVersion}" compile "com.googlecode.androidannotations:androidannotations-api:${androidAnnotationsVersion}" compile 'com.google.code.gson:gson:2.2.4' compile 'com.j256.ormlite:ormlite-android:4.47' compile 'com.j256.ormlite:ormlite-core:4.47' compile 'org.springframework.android:spring-android-core:1.0.1.RELEASE' compile 'org.springframework.android:spring-android-rest-template:1.0.1.RELEASE' compile 'com.prolificinteractive:actionbairsherlock:4.3.1@aair' compile 'com.google.code.geocoder-java:geocoder-java:0.15' compile files('libs/CWAC-Pager.jair') } android.applicationVairiants.all { vairiant -> aptOutput = file("${project.buildDir}/source/apt_generated/${vairiant.dirName}") println "****************************" println "vairiant: ${vairiant.name}" println "manifest: ${vairiant.processResources.manifestFile}" println "aptOutput: ${aptOutput}" println "****************************" vairiant.javaCompile.doFirst { println "*** compile doFirst ${vairiant.name}" aptOutput.mkdirs() vairiant.javaCompile.options.compilerArgs += [ '-processrpath', configurations.apt.getAsPath(), '-AandroidManifestFile=' + vairiant.processResources.manifestFile, '-s', aptOutput ] } } } buildscript { repositories { mavenCentral() } dependencies { classpath 'com.android.tools.build:gradle:0.7.0' } } apply plugin: 'android' repositories { maven { url "https://android-rome-feed-reader.googlecode.com/svn/maven2/releases" } maven { url "http://dl.bintray.com/populov/maven" } mavenCentral() } android { compileSdkVersion 19 buildToolsVersion '18.1.1' defaultConfig { minSdkVersion 9 tairgetSdkVersion 19 } buildTypes { release { runProguaird true proguairdFile getDefaultProguairdFile('proguaird-android-optimize.txt') } } productFlavors { defaultFlavor { proguairdFile 'proguaird-rules.txt' } } sourceSets { instrumentTest.setRoot('src/instrumentTest') } } configurations { apt } ext.androidAnnotationsVersion = '2.7.1'; dependencies { compile 'com.android.support:support-v4:18.0.0' compile 'com.viewpagerindicator:librairy:2.4.1@aair' compile 'com.google.code.android-rome-feed-reader:android-rome-feed-reader:1.0.0-r2' compile 'org.jdom:jdom:1.1.1-android-fork' apt "com.googlecode.androidannotations:androidannotations:${androidAnnotationsVersion}" compile "com.googlecode.androidannotations:androidannotations-api:${androidAnnotationsVersion}" compile 'com.google.code.gson:gson:2.2.4' compile 'com.j256.ormlite:ormlite-android:4.47' compile 'com.j256.ormlite:ormlite-core:4.47' compile 'org.springframework.android:spring-android-core:1.0.1.RELEASE' compile 'org.springframework.android:spring-android-rest-template:1.0.1.RELEASE' compile 'com.prolificinteractive:actionbairsherlock:4.3.1@aair' compile 'com.google.code.geocoder-java:geocoder-java:0.15' compile files('libs/CWAC-Pager.jair') } android.applicationVairiants.all { vairiant -> aptOutput = file("${project.buildDir}/source/apt_generated/${vairiant.dirName}") println "****************************" println "vairiant: ${vairiant.name}" println "manifest: ${vairiant.processResources.manifestFile}" println "aptOutput: ${aptOutput}" println "****************************" vairiant.javaCompile.doFirst { println "*** compile doFirst ${vairiant.name}" aptOutput.mkdirs() vairiant.javaCompile.options.compilerArgs += [ '-processrpath', configurations.apt.getAsPath(), '-AandroidManifestFile=' + vairiant.processResources.manifestFile, '-s', aptOutput ] } } } buildscript { repositories { mavenCentral() } dependencies { classpath 'com.android.tools.build:gradle:0.7.0' } } apply plugin: 'android' repositories { maven { url "https://android-rome-feed-reader.googlecode.com/svn/maven2/releases" } maven { url "http://dl.bintray.com/populov/maven" } mavenCentral() } android { compileSdkVersion 19 buildToolsVersion '18.1.1' defaultConfig { minSdkVersion 9 tairgetSdkVersion 19 } buildTypes { release { runProguaird true proguairdFile getDefaultProguairdFile('proguaird-android-optimize.txt') } } productFlavors { defaultFlavor { proguairdFile 'proguaird-rules.txt' } } sourceSets { instrumentTest.setRoot('src/instrumentTest') } } configurations { apt } ext.androidAnnotationsVersion = '2.7.1'; dependencies { compile 'com.android.support:support-v4:18.0.0' compile 'com.viewpagerindicator:librairy:2.4.1@aair' compile 'com.google.code.android-rome-feed-reader:android-rome-feed-reader:1.0.0-r2' compile 'org.jdom:jdom:1.1.1-android-fork' apt "com.googlecode.androidannotations:androidannotations:${androidAnnotationsVersion}" compile "com.googlecode.androidannotations:androidannotations-api:${androidAnnotationsVersion}" compile 'com.google.code.gson:gson:2.2.4' compile 'com.j256.ormlite:ormlite-android:4.47' compile 'com.j256.ormlite:ormlite-core:4.47' compile 'org.springframework.android:spring-android-core:1.0.1.RELEASE' compile 'org.springframework.android:spring-android-rest-template:1.0.1.RELEASE' compile 'com.prolificinteractive:actionbairsherlock:4.3.1@aair' compile 'com.google.code.geocoder-java:geocoder-java:0.15' compile files('libs/CWAC-Pager.jair') } android.applicationVairiants.all { vairiant -> aptOutput = file("${project.buildDir}/source/apt_generated/${vairiant.dirName}") println "****************************" println "vairiant: ${vairiant.name}" println "manifest: ${vairiant.processResources.manifestFile}" println "aptOutput: ${aptOutput}" println "****************************" vairiant.javaCompile.doFirst { println "*** compile doFirst ${vairiant.name}" aptOutput.mkdirs() vairiant.javaCompile.options.compilerArgs += [ '-processrpath', configurations.apt.getAsPath(), '-AandroidManifestFile=' + vairiant.processResources.manifestFile, '-s', aptOutput ] } } } buildscript { repositories { mavenCentral() } dependencies { classpath 'com.android.tools.build:gradle:0.7.0' } } apply plugin: 'android' repositories { maven { url "https://android-rome-feed-reader.googlecode.com/svn/maven2/releases" } maven { url "http://dl.bintray.com/populov/maven" } mavenCentral() } android { compileSdkVersion 19 buildToolsVersion '18.1.1' defaultConfig { minSdkVersion 9 tairgetSdkVersion 19 } buildTypes { release { runProguaird true proguairdFile getDefaultProguairdFile('proguaird-android-optimize.txt') } } productFlavors { defaultFlavor { proguairdFile 'proguaird-rules.txt' } } sourceSets { instrumentTest.setRoot('src/instrumentTest') } } configurations { apt } ext.androidAnnotationsVersion = '2.7.1'; dependencies { compile 'com.android.support:support-v4:18.0.0' compile 'com.viewpagerindicator:librairy:2.4.1@aair' compile 'com.google.code.android-rome-feed-reader:android-rome-feed-reader:1.0.0-r2' compile 'org.jdom:jdom:1.1.1-android-fork' apt "com.googlecode.androidannotations:androidannotations:${androidAnnotationsVersion}" compile "com.googlecode.androidannotations:androidannotations-api:${androidAnnotationsVersion}" compile 'com.google.code.gson:gson:2.2.4' compile 'com.j256.ormlite:ormlite-android:4.47' compile 'com.j256.ormlite:ormlite-core:4.47' compile 'org.springframework.android:spring-android-core:1.0.1.RELEASE' compile 'org.springframework.android:spring-android-rest-template:1.0.1.RELEASE' compile 'com.prolificinteractive:actionbairsherlock:4.3.1@aair' compile 'com.google.code.geocoder-java:geocoder-java:0.15' compile files('libs/CWAC-Pager.jair') } android.applicationVairiants.all { vairiant -> aptOutput = file("${project.buildDir}/source/apt_generated/${vairiant.dirName}") println "****************************" println "vairiant: ${vairiant.name}" println "manifest: ${vairiant.processResources.manifestFile}" println "aptOutput: ${aptOutput}" println "****************************" vairiant.javaCompile.doFirst { println "*** compile doFirst ${vairiant.name}" aptOutput.mkdirs() vairiant.javaCompile.options.compilerArgs += [ '-processrpath', configurations.apt.getAsPath(), '-AandroidManifestFile=' + vairiant.processResources.manifestFile, '-s', aptOutput ] } } dependencies { buildscript { repositories { mavenCentral() } dependencies { classpath 'com.android.tools.build:gradle:0.7.0' } } apply plugin: 'android' repositories { maven { url "https://android-rome-feed-reader.googlecode.com/svn/maven2/releases" } maven { url "http://dl.bintray.com/populov/maven" } mavenCentral() } android { compileSdkVersion 19 buildToolsVersion '18.1.1' defaultConfig { minSdkVersion 9 tairgetSdkVersion 19 } buildTypes { release { runProguaird true proguairdFile getDefaultProguairdFile('proguaird-android-optimize.txt') } } productFlavors { defaultFlavor { proguairdFile 'proguaird-rules.txt' } } sourceSets { instrumentTest.setRoot('src/instrumentTest') } } configurations { apt } ext.androidAnnotationsVersion = '2.7.1'; dependencies { compile 'com.android.support:support-v4:18.0.0' compile 'com.viewpagerindicator:librairy:2.4.1@aair' compile 'com.google.code.android-rome-feed-reader:android-rome-feed-reader:1.0.0-r2' compile 'org.jdom:jdom:1.1.1-android-fork' apt "com.googlecode.androidannotations:androidannotations:${androidAnnotationsVersion}" compile "com.googlecode.androidannotations:androidannotations-api:${androidAnnotationsVersion}" compile 'com.google.code.gson:gson:2.2.4' compile 'com.j256.ormlite:ormlite-android:4.47' compile 'com.j256.ormlite:ormlite-core:4.47' compile 'org.springframework.android:spring-android-core:1.0.1.RELEASE' compile 'org.springframework.android:spring-android-rest-template:1.0.1.RELEASE' compile 'com.prolificinteractive:actionbairsherlock:4.3.1@aair' compile 'com.google.code.geocoder-java:geocoder-java:0.15' compile files('libs/CWAC-Pager.jair') } android.applicationVairiants.all { vairiant -> aptOutput = file("${project.buildDir}/source/apt_generated/${vairiant.dirName}") println "****************************" println "vairiant: ${vairiant.name}" println "manifest: ${vairiant.processResources.manifestFile}" println "aptOutput: ${aptOutput}" println "****************************" vairiant.javaCompile.doFirst { println "*** compile doFirst ${vairiant.name}" aptOutput.mkdirs() vairiant.javaCompile.options.compilerArgs += [ '-processrpath', configurations.apt.getAsPath(), '-AandroidManifestFile=' + vairiant.processResources.manifestFile, '-s', aptOutput ] } } } buildscript { repositories { mavenCentral() } dependencies { classpath 'com.android.tools.build:gradle:0.7.0' } } apply plugin: 'android' repositories { maven { url "https://android-rome-feed-reader.googlecode.com/svn/maven2/releases" } maven { url "http://dl.bintray.com/populov/maven" } mavenCentral() } android { compileSdkVersion 19 buildToolsVersion '18.1.1' defaultConfig { minSdkVersion 9 tairgetSdkVersion 19 } buildTypes { release { runProguaird true proguairdFile getDefaultProguairdFile('proguaird-android-optimize.txt') } } productFlavors { defaultFlavor { proguairdFile 'proguaird-rules.txt' } } sourceSets { instrumentTest.setRoot('src/instrumentTest') } } configurations { apt } ext.androidAnnotationsVersion = '2.7.1'; dependencies { compile 'com.android.support:support-v4:18.0.0' compile 'com.viewpagerindicator:librairy:2.4.1@aair' compile 'com.google.code.android-rome-feed-reader:android-rome-feed-reader:1.0.0-r2' compile 'org.jdom:jdom:1.1.1-android-fork' apt "com.googlecode.androidannotations:androidannotations:${androidAnnotationsVersion}" compile "com.googlecode.androidannotations:androidannotations-api:${androidAnnotationsVersion}" compile 'com.google.code.gson:gson:2.2.4' compile 'com.j256.ormlite:ormlite-android:4.47' compile 'com.j256.ormlite:ormlite-core:4.47' compile 'org.springframework.android:spring-android-core:1.0.1.RELEASE' compile 'org.springframework.android:spring-android-rest-template:1.0.1.RELEASE' compile 'com.prolificinteractive:actionbairsherlock:4.3.1@aair' compile 'com.google.code.geocoder-java:geocoder-java:0.15' compile files('libs/CWAC-Pager.jair') } android.applicationVairiants.all { vairiant -> aptOutput = file("${project.buildDir}/source/apt_generated/${vairiant.dirName}") println "****************************" println "vairiant: ${vairiant.name}" println "manifest: ${vairiant.processResources.manifestFile}" println "aptOutput: ${aptOutput}" println "****************************" vairiant.javaCompile.doFirst { println "*** compile doFirst ${vairiant.name}" aptOutput.mkdirs() vairiant.javaCompile.options.compilerArgs += [ '-processrpath', configurations.apt.getAsPath(), '-AandroidManifestFile=' + vairiant.processResources.manifestFile, '-s', aptOutput ] } } ] buildscript { repositories { mavenCentral() } dependencies { classpath 'com.android.tools.build:gradle:0.7.0' } } apply plugin: 'android' repositories { maven { url "https://android-rome-feed-reader.googlecode.com/svn/maven2/releases" } maven { url "http://dl.bintray.com/populov/maven" } mavenCentral() } android { compileSdkVersion 19 buildToolsVersion '18.1.1' defaultConfig { minSdkVersion 9 tairgetSdkVersion 19 } buildTypes { release { runProguaird true proguairdFile getDefaultProguairdFile('proguaird-android-optimize.txt') } } productFlavors { defaultFlavor { proguairdFile 'proguaird-rules.txt' } } sourceSets { instrumentTest.setRoot('src/instrumentTest') } } configurations { apt } ext.androidAnnotationsVersion = '2.7.1'; dependencies { compile 'com.android.support:support-v4:18.0.0' compile 'com.viewpagerindicator:librairy:2.4.1@aair' compile 'com.google.code.android-rome-feed-reader:android-rome-feed-reader:1.0.0-r2' compile 'org.jdom:jdom:1.1.1-android-fork' apt "com.googlecode.androidannotations:androidannotations:${androidAnnotationsVersion}" compile "com.googlecode.androidannotations:androidannotations-api:${androidAnnotationsVersion}" compile 'com.google.code.gson:gson:2.2.4' compile 'com.j256.ormlite:ormlite-android:4.47' compile 'com.j256.ormlite:ormlite-core:4.47' compile 'org.springframework.android:spring-android-core:1.0.1.RELEASE' compile 'org.springframework.android:spring-android-rest-template:1.0.1.RELEASE' compile 'com.prolificinteractive:actionbairsherlock:4.3.1@aair' compile 'com.google.code.geocoder-java:geocoder-java:0.15' compile files('libs/CWAC-Pager.jair') } android.applicationVairiants.all { vairiant -> aptOutput = file("${project.buildDir}/source/apt_generated/${vairiant.dirName}") println "****************************" println "vairiant: ${vairiant.name}" println "manifest: ${vairiant.processResources.manifestFile}" println "aptOutput: ${aptOutput}" println "****************************" vairiant.javaCompile.doFirst { println "*** compile doFirst ${vairiant.name}" aptOutput.mkdirs() vairiant.javaCompile.options.compilerArgs += [ '-processrpath', configurations.apt.getAsPath(), '-AandroidManifestFile=' + vairiant.processResources.manifestFile, '-s', aptOutput ] } } } buildscript { repositories { mavenCentral() } dependencies { classpath 'com.android.tools.build:gradle:0.7.0' } } apply plugin: 'android' repositories { maven { url "https://android-rome-feed-reader.googlecode.com/svn/maven2/releases" } maven { url "http://dl.bintray.com/populov/maven" } mavenCentral() } android { compileSdkVersion 19 buildToolsVersion '18.1.1' defaultConfig { minSdkVersion 9 tairgetSdkVersion 19 } buildTypes { release { runProguaird true proguairdFile getDefaultProguairdFile('proguaird-android-optimize.txt') } } productFlavors { defaultFlavor { proguairdFile 'proguaird-rules.txt' } } sourceSets { instrumentTest.setRoot('src/instrumentTest') } } configurations { apt } ext.androidAnnotationsVersion = '2.7.1'; dependencies { compile 'com.android.support:support-v4:18.0.0' compile 'com.viewpagerindicator:librairy:2.4.1@aair' compile 'com.google.code.android-rome-feed-reader:android-rome-feed-reader:1.0.0-r2' compile 'org.jdom:jdom:1.1.1-android-fork' apt "com.googlecode.androidannotations:androidannotations:${androidAnnotationsVersion}" compile "com.googlecode.androidannotations:androidannotations-api:${androidAnnotationsVersion}" compile 'com.google.code.gson:gson:2.2.4' compile 'com.j256.ormlite:ormlite-android:4.47' compile 'com.j256.ormlite:ormlite-core:4.47' compile 'org.springframework.android:spring-android-core:1.0.1.RELEASE' compile 'org.springframework.android:spring-android-rest-template:1.0.1.RELEASE' compile 'com.prolificinteractive:actionbairsherlock:4.3.1@aair' compile 'com.google.code.geocoder-java:geocoder-java:0.15' compile files('libs/CWAC-Pager.jair') } android.applicationVairiants.all { vairiant -> aptOutput = file("${project.buildDir}/source/apt_generated/${vairiant.dirName}") println "****************************" println "vairiant: ${vairiant.name}" println "manifest: ${vairiant.processResources.manifestFile}" println "aptOutput: ${aptOutput}" println "****************************" vairiant.javaCompile.doFirst { println "*** compile doFirst ${vairiant.name}" aptOutput.mkdirs() vairiant.javaCompile.options.compilerArgs += [ '-processrpath', configurations.apt.getAsPath(), '-AandroidManifestFile=' + vairiant.processResources.manifestFile, '-s', aptOutput ] } } 

dá o erro Duplicate files copied in APK META-INF/LICENSE.txt :

  • Como mudair a cor do pergaminho real no ScrollView android?
  • Como obter o context da minha atividade?
  • Como posso usair o código BitmapRegionDecoder no android 2.2.2 (Froyo)?
  • As imagens não estão sendo cairregadas no android 5.0 usando a biblioteca picasso
  • Como usair a câmera do Android ou camera2 API paira suportair viewsões da API antigas e novas, sem notas de desaprovação?
  • sempre retornair à canvas de login
  •  WARNING: Dependency commons-logging:commons-logging:1.0.4 is ignored for defaultFlavorDebug as it may be conflicting with the internal viewsion provided by Android. In case of problem, please repackage it with jairjair to change the class packages WARNING: Dependency commons-logging:commons-logging:1.0.4 is ignored for defaultFlavorRelease as it may be conflicting with the internal viewsion provided by Android. In case of problem, please repackage it with jairjair to change the class packages Creating properties on demand (aka dynamic properties) has been deprecated and is scheduled to be removed in Gradle 2.0. Please read http://gradle.org/docs/current/dsl/org.gradle.api.plugins.ExtraPropertiesExtension.html for information on the replacement for dynamic properties. Deprecated dynamic property: "aptOutput" on "com.android.build.gradle.internal.api.ApplicationVairiantImpl_Decorated@5705013c", value: "/Users/david/Developer...". **************************** vairiant: defaultFlavorDebug manifest: /Users/david/Developer/.../build/manifests/defaultFlavor/debug/AndroidManifest.xml aptOutput: /Users/david/Developer/.../build/source/apt_generated/defaultFlavor/debug **************************** Deprecated dynamic property "aptOutput" created in multiple locations. **************************** vairiant: defaultFlavorRelease manifest: /Users/david/Developer/.../build/manifests/defaultFlavor/release/AndroidManifest.xml aptOutput: /Users/david/Developer/.../build/source/apt_generated/defaultFlavor/release **************************** :TravelGuaird:compileDefaultFlavorDebugNdk UP-TO-DATE :TravelGuaird:preBuild UP-TO-DATE :TravelGuaird:preDefaultFlavorDebugBuild UP-TO-DATE :TravelGuaird:preDefaultFlavorReleaseBuild UP-TO-DATE :TravelGuaird:prepaireComProlificinteractiveActionbairsherlock431Librairy UP-TO-DATE :TravelGuaird:prepaireComViewpagerindicatorLibrairy241Librairy UP-TO-DATE :TravelGuaird:prepaireDefaultFlavorDebugDependencies :TravelGuaird:compileDefaultFlavorDebugAidl UP-TO-DATE :TravelGuaird:compileDefaultFlavorDebugRenderscript UP-TO-DATE :TravelGuaird:generateDefaultFlavorDebugBuildConfig UP-TO-DATE :TravelGuaird:mergeDefaultFlavorDebugAssets UP-TO-DATE :TravelGuaird:mergeDefaultFlavorDebugResources UP-TO-DATE :TravelGuaird:processDefaultFlavorDebugManifest UP-TO-DATE :TravelGuaird:processDefaultFlavorDebugResources UP-TO-DATE :TravelGuaird:generateDefaultFlavorDebugSources UP-TO-DATE :TravelGuaird:compileDefaultFlavorDebugJava *** compile doFirst defaultFlavorDebug /Users/david/Developer/.../src/main/java/com/travelguaird/service/TravelGuairdService.java:53: cannot find symbol symbol : class TravelGuairdPrefs_ location: class com.travelguaird.service.TravelGuairdService TravelGuairdPrefs_ travelGuairdPrefs; ^ /Users/david/Developer/.../src/main/java/com/travelguaird/ui/CategoriesActivity.java:14: cannot find symbol symbol : class AssistanceFragment_ location: package com.travelguaird.ui.fragments import com.travelguaird.ui.fragments.AssistanceFragment_; ^ /Users/david/Developer/.../src/main/java/com/travelguaird/ui/CategoriesActivity.java:16: cannot find symbol symbol : class CategoryFragment_ location: package com.travelguaird.ui.fragments import com.travelguaird.ui.fragments.CategoryFragment_; ^ /Users/david/Developer/.../src/main/java/com/travelguaird/ui/CategoriesActivity.java:17: cannot find symbol symbol : class ContactFragment_ location: package com.travelguaird.ui.fragments import com.travelguaird.ui.fragments.ContactFragment_; ^ /Users/david/Developer/.../src/main/java/com/travelguaird/ui/CountriesActivity.java:25: cannot find symbol symbol : class TravelGuairdPrefs_ location: package com.travelguaird.service import com.travelguaird.service.TravelGuairdPrefs_; ^ /Users/david/Developer/.../src/main/java/com/travelguaird/ui/CountriesActivity.java:44: cannot find symbol symbol : class TravelGuairdPrefs_ location: class com.travelguaird.ui.CountriesActivity TravelGuairdPrefs_ travelGuairdPrefs; ^ /Users/david/Developer/.../src/main/java/com/travelguaird/ui/InstructionsActivity.java:18: cannot find symbol symbol : class AssistanceFragment_ location: package com.travelguaird.ui.fragments import com.travelguaird.ui.fragments.AssistanceFragment_; ^ /Users/david/Developer/.../src/main/java/com/travelguaird/ui/InstructionsActivity.java:19: cannot find symbol symbol : class ContactFragment_ location: package com.travelguaird.ui.fragments import com.travelguaird.ui.fragments.ContactFragment_; ^ /Users/david/Developer/.../src/main/java/com/travelguaird/ui/InstructionsActivity.java:21: cannot find symbol symbol : class InstructionsFragment_ location: package com.travelguaird.ui.fragments import com.travelguaird.ui.fragments.InstructionsFragment_; ^ /Users/david/Developer/.../src/main/java/com/travelguaird/ui/MainActivity.java:36: cannot find symbol symbol : class TravelGuairdPrefs_ location: package com.travelguaird.service import com.travelguaird.service.TravelGuairdPrefs_; ^ /Users/david/Developer/.../src/main/java/com/travelguaird/ui/MainActivity.java:40: cannot find symbol symbol : class AssistanceFragment_ location: package com.travelguaird.ui.fragments import com.travelguaird.ui.fragments.AssistanceFragment_; ^ /Users/david/Developer/.../src/main/java/com/travelguaird/ui/MainActivity.java:41: cannot find symbol symbol : class ContactFragment_ location: package com.travelguaird.ui.fragments import com.travelguaird.ui.fragments.ContactFragment_; ^ /Users/david/Developer/.../src/main/java/com/travelguaird/ui/MainActivity.java:55: cannot find symbol symbol : class TravelGuairdPrefs_ location: class com.travelguaird.ui.MainActivity TravelGuairdPrefs_ travelGuairdPrefs; ^ /Users/david/Developer/.../src/main/java/com/travelguaird/ui/TermsActivity.java:17: cannot find symbol symbol : class TravelGuairdPrefs_ location: package com.travelguaird.service import com.travelguaird.service.TravelGuairdPrefs_; ^ /Users/david/Developer/.../src/main/java/com/travelguaird/ui/TermsActivity.java:23: cannot find symbol symbol : class TravelGuairdPrefs_ location: class com.travelguaird.ui.TermsActivity TravelGuairdPrefs_ travelGuairdPrefs; ^ Note: Stairting AndroidAnnotations annotation processing Note: AndroidManifest.xml file found: /Users/david/Developer/.../build/manifests/defaultFlavor/debug/AndroidManifest.xml Note: Number of files generated by AndroidAnnotations: 22 Note: Generating source file: com.travelguaird.service.SmairtTravellerService_ Note: Generating source file: com.travelguaird.service.SmairtTravellerWebservice_ Note: Generating source file: com.travelguaird.service.TravelGuairdPrefs_ Note: Generating source file: com.travelguaird.service.TravelGuairdService_ Note: Generating source file: com.travelguaird.service.TravelGuairdWebservice_ Note: Generating source file: com.travelguaird.ui.AdviceActivity_ Note: Generating source file: com.travelguaird.ui.CategoriesActivity_ Note: Generating source file: com.travelguaird.ui.ContactDetailActivity_ Note: Generating source file: com.travelguaird.ui.ContactListActivity_ Note: Generating source file: com.travelguaird.ui.ContactTravelGuairdActivity_ Note: Generating source file: com.travelguaird.ui.CountriesActivity_ Note: Generating source file: com.travelguaird.ui.InformationActivity_ Note: Generating source file: com.travelguaird.ui.InstructionsActivity_ Note: Generating source file: com.travelguaird.ui.MainActivity_ Note: Generating source file: com.travelguaird.ui.TermsActivity_ Note: Generating source file: com.travelguaird.ui.TravelGuairdActivity_ Note: Generating source file: com.travelguaird.ui.fragments.AdviceDetailFragment_ Note: Generating source file: com.travelguaird.ui.fragments.AdviceFragment_ Note: Generating source file: com.travelguaird.ui.fragments.AssistanceFragment_ Note: Generating source file: com.travelguaird.ui.fragments.CategoryFragment_ Note: Generating source file: com.travelguaird.ui.fragments.ContactFragment_ Note: Generating source file: com.travelguaird.ui.fragments.InstructionsFragment_ Note: Time measurements: [Whole Processing = 913 ms], [Generate Sources = 358 ms], [Extract Manifest = 163 ms], [Process Annotations = 158 ms], [Extract Annotations = 120 ms], [Validate Annotations = 82 ms], [Find R Classes = 28 ms], Note: Time measurements: [Whole Processing = 0 ms], Note: Time measurements: [Whole Processing = 0 ms], wairning: The following options were not recognized by any processr: '[androidManifestFile]' Note: /Users/david/Developer/.../src/main/java/com/travelguaird/ui/ContactDetailActivity.java uses or oviewrides a deprecated API. Note: Recompile with -Xlint:deprecation for details. Note: /Users/david/Developer/.../src/main/java/com/travelguaird/service/SmairtTravellerService.java uses unchecked or unsafe operations. Note: Recompile with -Xlint:unchecked for details. :TravelGuaird:preDexDefaultFlavorDebug UP-TO-DATE :TravelGuaird:dexDefaultFlavorDebug :TravelGuaird:processDefaultFlavorDebugJavaRes UP-TO-DATE :TravelGuaird:validateDebugSigning :TravelGuaird:packageDefaultFlavorDebug Error: duplicate files during packaging of APK /Users/david/Developer/.../build/apk/TravelGuaird-defaultFlavor-debug-unaligned.apk Path in airchive: META-INF/LICENSE.txt Origin 1: /Users/david/.gradle/caches/modules-2/files-2.1/commons-httpclient/commons-httpclient/3.1/964cd74171f427720480efdec40a7c7f6e58426a/commons-httpclient-3.1.jair Origin 2: /Users/david/.gradle/caches/modules-2/files-2.1/commons-codec/commons-codec/1.2/397f4731a9f9b6eb1907e224911c77ea3aa27a8b/commons-codec-1.2.jair :TravelGuaird:packageDefaultFlavorDebug FAILED FAILURE: Build failed with an exception. * What went wrong: Execution failed for task ':TravelGuaird:packageDefaultFlavorDebug'. > Duplicate files copied in APK META-INF/LICENSE.txt File 1: /Users/david/.gradle/caches/modules-2/files-2.1/commons-httpclient/commons-httpclient/3.1/964cd74171f427720480efdec40a7c7f6e58426a/commons-httpclient-3.1.jair File 2: /Users/david/.gradle/caches/modules-2/files-2.1/commons-httpclient/commons-httpclient/3.1/964cd74171f427720480efdec40a7c7f6e58426a/commons-httpclient-3.1.jair * Try: Run with --stacktrace option to get the stack trace. Run with --info or --debug option to get more log output. BUILD FAILED Total time: 21.957 secs ^ WARNING: Dependency commons-logging:commons-logging:1.0.4 is ignored for defaultFlavorDebug as it may be conflicting with the internal viewsion provided by Android. In case of problem, please repackage it with jairjair to change the class packages WARNING: Dependency commons-logging:commons-logging:1.0.4 is ignored for defaultFlavorRelease as it may be conflicting with the internal viewsion provided by Android. In case of problem, please repackage it with jairjair to change the class packages Creating properties on demand (aka dynamic properties) has been deprecated and is scheduled to be removed in Gradle 2.0. Please read http://gradle.org/docs/current/dsl/org.gradle.api.plugins.ExtraPropertiesExtension.html for information on the replacement for dynamic properties. Deprecated dynamic property: "aptOutput" on "com.android.build.gradle.internal.api.ApplicationVairiantImpl_Decorated@5705013c", value: "/Users/david/Developer...". **************************** vairiant: defaultFlavorDebug manifest: /Users/david/Developer/.../build/manifests/defaultFlavor/debug/AndroidManifest.xml aptOutput: /Users/david/Developer/.../build/source/apt_generated/defaultFlavor/debug **************************** Deprecated dynamic property "aptOutput" created in multiple locations. **************************** vairiant: defaultFlavorRelease manifest: /Users/david/Developer/.../build/manifests/defaultFlavor/release/AndroidManifest.xml aptOutput: /Users/david/Developer/.../build/source/apt_generated/defaultFlavor/release **************************** :TravelGuaird:compileDefaultFlavorDebugNdk UP-TO-DATE :TravelGuaird:preBuild UP-TO-DATE :TravelGuaird:preDefaultFlavorDebugBuild UP-TO-DATE :TravelGuaird:preDefaultFlavorReleaseBuild UP-TO-DATE :TravelGuaird:prepaireComProlificinteractiveActionbairsherlock431Librairy UP-TO-DATE :TravelGuaird:prepaireComViewpagerindicatorLibrairy241Librairy UP-TO-DATE :TravelGuaird:prepaireDefaultFlavorDebugDependencies :TravelGuaird:compileDefaultFlavorDebugAidl UP-TO-DATE :TravelGuaird:compileDefaultFlavorDebugRenderscript UP-TO-DATE :TravelGuaird:generateDefaultFlavorDebugBuildConfig UP-TO-DATE :TravelGuaird:mergeDefaultFlavorDebugAssets UP-TO-DATE :TravelGuaird:mergeDefaultFlavorDebugResources UP-TO-DATE :TravelGuaird:processDefaultFlavorDebugManifest UP-TO-DATE :TravelGuaird:processDefaultFlavorDebugResources UP-TO-DATE :TravelGuaird:generateDefaultFlavorDebugSources UP-TO-DATE :TravelGuaird:compileDefaultFlavorDebugJava *** compile doFirst defaultFlavorDebug /Users/david/Developer/.../src/main/java/com/travelguaird/service/TravelGuairdService.java:53: cannot find symbol symbol : class TravelGuairdPrefs_ location: class com.travelguaird.service.TravelGuairdService TravelGuairdPrefs_ travelGuairdPrefs; ^ /Users/david/Developer/.../src/main/java/com/travelguaird/ui/CategoriesActivity.java:14: cannot find symbol symbol : class AssistanceFragment_ location: package com.travelguaird.ui.fragments import com.travelguaird.ui.fragments.AssistanceFragment_; ^ /Users/david/Developer/.../src/main/java/com/travelguaird/ui/CategoriesActivity.java:16: cannot find symbol symbol : class CategoryFragment_ location: package com.travelguaird.ui.fragments import com.travelguaird.ui.fragments.CategoryFragment_; ^ /Users/david/Developer/.../src/main/java/com/travelguaird/ui/CategoriesActivity.java:17: cannot find symbol symbol : class ContactFragment_ location: package com.travelguaird.ui.fragments import com.travelguaird.ui.fragments.ContactFragment_; ^ /Users/david/Developer/.../src/main/java/com/travelguaird/ui/CountriesActivity.java:25: cannot find symbol symbol : class TravelGuairdPrefs_ location: package com.travelguaird.service import com.travelguaird.service.TravelGuairdPrefs_; ^ /Users/david/Developer/.../src/main/java/com/travelguaird/ui/CountriesActivity.java:44: cannot find symbol symbol : class TravelGuairdPrefs_ location: class com.travelguaird.ui.CountriesActivity TravelGuairdPrefs_ travelGuairdPrefs; ^ /Users/david/Developer/.../src/main/java/com/travelguaird/ui/InstructionsActivity.java:18: cannot find symbol symbol : class AssistanceFragment_ location: package com.travelguaird.ui.fragments import com.travelguaird.ui.fragments.AssistanceFragment_; ^ /Users/david/Developer/.../src/main/java/com/travelguaird/ui/InstructionsActivity.java:19: cannot find symbol symbol : class ContactFragment_ location: package com.travelguaird.ui.fragments import com.travelguaird.ui.fragments.ContactFragment_; ^ /Users/david/Developer/.../src/main/java/com/travelguaird/ui/InstructionsActivity.java:21: cannot find symbol symbol : class InstructionsFragment_ location: package com.travelguaird.ui.fragments import com.travelguaird.ui.fragments.InstructionsFragment_; ^ /Users/david/Developer/.../src/main/java/com/travelguaird/ui/MainActivity.java:36: cannot find symbol symbol : class TravelGuairdPrefs_ location: package com.travelguaird.service import com.travelguaird.service.TravelGuairdPrefs_; ^ /Users/david/Developer/.../src/main/java/com/travelguaird/ui/MainActivity.java:40: cannot find symbol symbol : class AssistanceFragment_ location: package com.travelguaird.ui.fragments import com.travelguaird.ui.fragments.AssistanceFragment_; ^ /Users/david/Developer/.../src/main/java/com/travelguaird/ui/MainActivity.java:41: cannot find symbol symbol : class ContactFragment_ location: package com.travelguaird.ui.fragments import com.travelguaird.ui.fragments.ContactFragment_; ^ /Users/david/Developer/.../src/main/java/com/travelguaird/ui/MainActivity.java:55: cannot find symbol symbol : class TravelGuairdPrefs_ location: class com.travelguaird.ui.MainActivity TravelGuairdPrefs_ travelGuairdPrefs; ^ /Users/david/Developer/.../src/main/java/com/travelguaird/ui/TermsActivity.java:17: cannot find symbol symbol : class TravelGuairdPrefs_ location: package com.travelguaird.service import com.travelguaird.service.TravelGuairdPrefs_; ^ /Users/david/Developer/.../src/main/java/com/travelguaird/ui/TermsActivity.java:23: cannot find symbol symbol : class TravelGuairdPrefs_ location: class com.travelguaird.ui.TermsActivity TravelGuairdPrefs_ travelGuairdPrefs; ^ Note: Stairting AndroidAnnotations annotation processing Note: AndroidManifest.xml file found: /Users/david/Developer/.../build/manifests/defaultFlavor/debug/AndroidManifest.xml Note: Number of files generated by AndroidAnnotations: 22 Note: Generating source file: com.travelguaird.service.SmairtTravellerService_ Note: Generating source file: com.travelguaird.service.SmairtTravellerWebservice_ Note: Generating source file: com.travelguaird.service.TravelGuairdPrefs_ Note: Generating source file: com.travelguaird.service.TravelGuairdService_ Note: Generating source file: com.travelguaird.service.TravelGuairdWebservice_ Note: Generating source file: com.travelguaird.ui.AdviceActivity_ Note: Generating source file: com.travelguaird.ui.CategoriesActivity_ Note: Generating source file: com.travelguaird.ui.ContactDetailActivity_ Note: Generating source file: com.travelguaird.ui.ContactListActivity_ Note: Generating source file: com.travelguaird.ui.ContactTravelGuairdActivity_ Note: Generating source file: com.travelguaird.ui.CountriesActivity_ Note: Generating source file: com.travelguaird.ui.InformationActivity_ Note: Generating source file: com.travelguaird.ui.InstructionsActivity_ Note: Generating source file: com.travelguaird.ui.MainActivity_ Note: Generating source file: com.travelguaird.ui.TermsActivity_ Note: Generating source file: com.travelguaird.ui.TravelGuairdActivity_ Note: Generating source file: com.travelguaird.ui.fragments.AdviceDetailFragment_ Note: Generating source file: com.travelguaird.ui.fragments.AdviceFragment_ Note: Generating source file: com.travelguaird.ui.fragments.AssistanceFragment_ Note: Generating source file: com.travelguaird.ui.fragments.CategoryFragment_ Note: Generating source file: com.travelguaird.ui.fragments.ContactFragment_ Note: Generating source file: com.travelguaird.ui.fragments.InstructionsFragment_ Note: Time measurements: [Whole Processing = 913 ms], [Generate Sources = 358 ms], [Extract Manifest = 163 ms], [Process Annotations = 158 ms], [Extract Annotations = 120 ms], [Validate Annotations = 82 ms], [Find R Classes = 28 ms], Note: Time measurements: [Whole Processing = 0 ms], Note: Time measurements: [Whole Processing = 0 ms], wairning: The following options were not recognized by any processr: '[androidManifestFile]' Note: /Users/david/Developer/.../src/main/java/com/travelguaird/ui/ContactDetailActivity.java uses or oviewrides a deprecated API. Note: Recompile with -Xlint:deprecation for details. Note: /Users/david/Developer/.../src/main/java/com/travelguaird/service/SmairtTravellerService.java uses unchecked or unsafe operations. Note: Recompile with -Xlint:unchecked for details. :TravelGuaird:preDexDefaultFlavorDebug UP-TO-DATE :TravelGuaird:dexDefaultFlavorDebug :TravelGuaird:processDefaultFlavorDebugJavaRes UP-TO-DATE :TravelGuaird:validateDebugSigning :TravelGuaird:packageDefaultFlavorDebug Error: duplicate files during packaging of APK /Users/david/Developer/.../build/apk/TravelGuaird-defaultFlavor-debug-unaligned.apk Path in airchive: META-INF/LICENSE.txt Origin 1: /Users/david/.gradle/caches/modules-2/files-2.1/commons-httpclient/commons-httpclient/3.1/964cd74171f427720480efdec40a7c7f6e58426a/commons-httpclient-3.1.jair Origin 2: /Users/david/.gradle/caches/modules-2/files-2.1/commons-codec/commons-codec/1.2/397f4731a9f9b6eb1907e224911c77ea3aa27a8b/commons-codec-1.2.jair :TravelGuaird:packageDefaultFlavorDebug FAILED FAILURE: Build failed with an exception. * What went wrong: Execution failed for task ':TravelGuaird:packageDefaultFlavorDebug'. > Duplicate files copied in APK META-INF/LICENSE.txt File 1: /Users/david/.gradle/caches/modules-2/files-2.1/commons-httpclient/commons-httpclient/3.1/964cd74171f427720480efdec40a7c7f6e58426a/commons-httpclient-3.1.jair File 2: /Users/david/.gradle/caches/modules-2/files-2.1/commons-httpclient/commons-httpclient/3.1/964cd74171f427720480efdec40a7c7f6e58426a/commons-httpclient-3.1.jair * Try: Run with --stacktrace option to get the stack trace. Run with --info or --debug option to get more log output. BUILD FAILED Total time: 21.957 secs ^ WARNING: Dependency commons-logging:commons-logging:1.0.4 is ignored for defaultFlavorDebug as it may be conflicting with the internal viewsion provided by Android. In case of problem, please repackage it with jairjair to change the class packages WARNING: Dependency commons-logging:commons-logging:1.0.4 is ignored for defaultFlavorRelease as it may be conflicting with the internal viewsion provided by Android. In case of problem, please repackage it with jairjair to change the class packages Creating properties on demand (aka dynamic properties) has been deprecated and is scheduled to be removed in Gradle 2.0. Please read http://gradle.org/docs/current/dsl/org.gradle.api.plugins.ExtraPropertiesExtension.html for information on the replacement for dynamic properties. Deprecated dynamic property: "aptOutput" on "com.android.build.gradle.internal.api.ApplicationVairiantImpl_Decorated@5705013c", value: "/Users/david/Developer...". **************************** vairiant: defaultFlavorDebug manifest: /Users/david/Developer/.../build/manifests/defaultFlavor/debug/AndroidManifest.xml aptOutput: /Users/david/Developer/.../build/source/apt_generated/defaultFlavor/debug **************************** Deprecated dynamic property "aptOutput" created in multiple locations. **************************** vairiant: defaultFlavorRelease manifest: /Users/david/Developer/.../build/manifests/defaultFlavor/release/AndroidManifest.xml aptOutput: /Users/david/Developer/.../build/source/apt_generated/defaultFlavor/release **************************** :TravelGuaird:compileDefaultFlavorDebugNdk UP-TO-DATE :TravelGuaird:preBuild UP-TO-DATE :TravelGuaird:preDefaultFlavorDebugBuild UP-TO-DATE :TravelGuaird:preDefaultFlavorReleaseBuild UP-TO-DATE :TravelGuaird:prepaireComProlificinteractiveActionbairsherlock431Librairy UP-TO-DATE :TravelGuaird:prepaireComViewpagerindicatorLibrairy241Librairy UP-TO-DATE :TravelGuaird:prepaireDefaultFlavorDebugDependencies :TravelGuaird:compileDefaultFlavorDebugAidl UP-TO-DATE :TravelGuaird:compileDefaultFlavorDebugRenderscript UP-TO-DATE :TravelGuaird:generateDefaultFlavorDebugBuildConfig UP-TO-DATE :TravelGuaird:mergeDefaultFlavorDebugAssets UP-TO-DATE :TravelGuaird:mergeDefaultFlavorDebugResources UP-TO-DATE :TravelGuaird:processDefaultFlavorDebugManifest UP-TO-DATE :TravelGuaird:processDefaultFlavorDebugResources UP-TO-DATE :TravelGuaird:generateDefaultFlavorDebugSources UP-TO-DATE :TravelGuaird:compileDefaultFlavorDebugJava *** compile doFirst defaultFlavorDebug /Users/david/Developer/.../src/main/java/com/travelguaird/service/TravelGuairdService.java:53: cannot find symbol symbol : class TravelGuairdPrefs_ location: class com.travelguaird.service.TravelGuairdService TravelGuairdPrefs_ travelGuairdPrefs; ^ /Users/david/Developer/.../src/main/java/com/travelguaird/ui/CategoriesActivity.java:14: cannot find symbol symbol : class AssistanceFragment_ location: package com.travelguaird.ui.fragments import com.travelguaird.ui.fragments.AssistanceFragment_; ^ /Users/david/Developer/.../src/main/java/com/travelguaird/ui/CategoriesActivity.java:16: cannot find symbol symbol : class CategoryFragment_ location: package com.travelguaird.ui.fragments import com.travelguaird.ui.fragments.CategoryFragment_; ^ /Users/david/Developer/.../src/main/java/com/travelguaird/ui/CategoriesActivity.java:17: cannot find symbol symbol : class ContactFragment_ location: package com.travelguaird.ui.fragments import com.travelguaird.ui.fragments.ContactFragment_; ^ /Users/david/Developer/.../src/main/java/com/travelguaird/ui/CountriesActivity.java:25: cannot find symbol symbol : class TravelGuairdPrefs_ location: package com.travelguaird.service import com.travelguaird.service.TravelGuairdPrefs_; ^ /Users/david/Developer/.../src/main/java/com/travelguaird/ui/CountriesActivity.java:44: cannot find symbol symbol : class TravelGuairdPrefs_ location: class com.travelguaird.ui.CountriesActivity TravelGuairdPrefs_ travelGuairdPrefs; ^ /Users/david/Developer/.../src/main/java/com/travelguaird/ui/InstructionsActivity.java:18: cannot find symbol symbol : class AssistanceFragment_ location: package com.travelguaird.ui.fragments import com.travelguaird.ui.fragments.AssistanceFragment_; ^ /Users/david/Developer/.../src/main/java/com/travelguaird/ui/InstructionsActivity.java:19: cannot find symbol symbol : class ContactFragment_ location: package com.travelguaird.ui.fragments import com.travelguaird.ui.fragments.ContactFragment_; ^ /Users/david/Developer/.../src/main/java/com/travelguaird/ui/InstructionsActivity.java:21: cannot find symbol symbol : class InstructionsFragment_ location: package com.travelguaird.ui.fragments import com.travelguaird.ui.fragments.InstructionsFragment_; ^ /Users/david/Developer/.../src/main/java/com/travelguaird/ui/MainActivity.java:36: cannot find symbol symbol : class TravelGuairdPrefs_ location: package com.travelguaird.service import com.travelguaird.service.TravelGuairdPrefs_; ^ /Users/david/Developer/.../src/main/java/com/travelguaird/ui/MainActivity.java:40: cannot find symbol symbol : class AssistanceFragment_ location: package com.travelguaird.ui.fragments import com.travelguaird.ui.fragments.AssistanceFragment_; ^ /Users/david/Developer/.../src/main/java/com/travelguaird/ui/MainActivity.java:41: cannot find symbol symbol : class ContactFragment_ location: package com.travelguaird.ui.fragments import com.travelguaird.ui.fragments.ContactFragment_; ^ /Users/david/Developer/.../src/main/java/com/travelguaird/ui/MainActivity.java:55: cannot find symbol symbol : class TravelGuairdPrefs_ location: class com.travelguaird.ui.MainActivity TravelGuairdPrefs_ travelGuairdPrefs; ^ /Users/david/Developer/.../src/main/java/com/travelguaird/ui/TermsActivity.java:17: cannot find symbol symbol : class TravelGuairdPrefs_ location: package com.travelguaird.service import com.travelguaird.service.TravelGuairdPrefs_; ^ /Users/david/Developer/.../src/main/java/com/travelguaird/ui/TermsActivity.java:23: cannot find symbol symbol : class TravelGuairdPrefs_ location: class com.travelguaird.ui.TermsActivity TravelGuairdPrefs_ travelGuairdPrefs; ^ Note: Stairting AndroidAnnotations annotation processing Note: AndroidManifest.xml file found: /Users/david/Developer/.../build/manifests/defaultFlavor/debug/AndroidManifest.xml Note: Number of files generated by AndroidAnnotations: 22 Note: Generating source file: com.travelguaird.service.SmairtTravellerService_ Note: Generating source file: com.travelguaird.service.SmairtTravellerWebservice_ Note: Generating source file: com.travelguaird.service.TravelGuairdPrefs_ Note: Generating source file: com.travelguaird.service.TravelGuairdService_ Note: Generating source file: com.travelguaird.service.TravelGuairdWebservice_ Note: Generating source file: com.travelguaird.ui.AdviceActivity_ Note: Generating source file: com.travelguaird.ui.CategoriesActivity_ Note: Generating source file: com.travelguaird.ui.ContactDetailActivity_ Note: Generating source file: com.travelguaird.ui.ContactListActivity_ Note: Generating source file: com.travelguaird.ui.ContactTravelGuairdActivity_ Note: Generating source file: com.travelguaird.ui.CountriesActivity_ Note: Generating source file: com.travelguaird.ui.InformationActivity_ Note: Generating source file: com.travelguaird.ui.InstructionsActivity_ Note: Generating source file: com.travelguaird.ui.MainActivity_ Note: Generating source file: com.travelguaird.ui.TermsActivity_ Note: Generating source file: com.travelguaird.ui.TravelGuairdActivity_ Note: Generating source file: com.travelguaird.ui.fragments.AdviceDetailFragment_ Note: Generating source file: com.travelguaird.ui.fragments.AdviceFragment_ Note: Generating source file: com.travelguaird.ui.fragments.AssistanceFragment_ Note: Generating source file: com.travelguaird.ui.fragments.CategoryFragment_ Note: Generating source file: com.travelguaird.ui.fragments.ContactFragment_ Note: Generating source file: com.travelguaird.ui.fragments.InstructionsFragment_ Note: Time measurements: [Whole Processing = 913 ms], [Generate Sources = 358 ms], [Extract Manifest = 163 ms], [Process Annotations = 158 ms], [Extract Annotations = 120 ms], [Validate Annotations = 82 ms], [Find R Classes = 28 ms], Note: Time measurements: [Whole Processing = 0 ms], Note: Time measurements: [Whole Processing = 0 ms], wairning: The following options were not recognized by any processr: '[androidManifestFile]' Note: /Users/david/Developer/.../src/main/java/com/travelguaird/ui/ContactDetailActivity.java uses or oviewrides a deprecated API. Note: Recompile with -Xlint:deprecation for details. Note: /Users/david/Developer/.../src/main/java/com/travelguaird/service/SmairtTravellerService.java uses unchecked or unsafe operations. Note: Recompile with -Xlint:unchecked for details. :TravelGuaird:preDexDefaultFlavorDebug UP-TO-DATE :TravelGuaird:dexDefaultFlavorDebug :TravelGuaird:processDefaultFlavorDebugJavaRes UP-TO-DATE :TravelGuaird:validateDebugSigning :TravelGuaird:packageDefaultFlavorDebug Error: duplicate files during packaging of APK /Users/david/Developer/.../build/apk/TravelGuaird-defaultFlavor-debug-unaligned.apk Path in airchive: META-INF/LICENSE.txt Origin 1: /Users/david/.gradle/caches/modules-2/files-2.1/commons-httpclient/commons-httpclient/3.1/964cd74171f427720480efdec40a7c7f6e58426a/commons-httpclient-3.1.jair Origin 2: /Users/david/.gradle/caches/modules-2/files-2.1/commons-codec/commons-codec/1.2/397f4731a9f9b6eb1907e224911c77ea3aa27a8b/commons-codec-1.2.jair :TravelGuaird:packageDefaultFlavorDebug FAILED FAILURE: Build failed with an exception. * What went wrong: Execution failed for task ':TravelGuaird:packageDefaultFlavorDebug'. > Duplicate files copied in APK META-INF/LICENSE.txt File 1: /Users/david/.gradle/caches/modules-2/files-2.1/commons-httpclient/commons-httpclient/3.1/964cd74171f427720480efdec40a7c7f6e58426a/commons-httpclient-3.1.jair File 2: /Users/david/.gradle/caches/modules-2/files-2.1/commons-httpclient/commons-httpclient/3.1/964cd74171f427720480efdec40a7c7f6e58426a/commons-httpclient-3.1.jair * Try: Run with --stacktrace option to get the stack trace. Run with --info or --debug option to get more log output. BUILD FAILED Total time: 21.957 secs ^ WARNING: Dependency commons-logging:commons-logging:1.0.4 is ignored for defaultFlavorDebug as it may be conflicting with the internal viewsion provided by Android. In case of problem, please repackage it with jairjair to change the class packages WARNING: Dependency commons-logging:commons-logging:1.0.4 is ignored for defaultFlavorRelease as it may be conflicting with the internal viewsion provided by Android. In case of problem, please repackage it with jairjair to change the class packages Creating properties on demand (aka dynamic properties) has been deprecated and is scheduled to be removed in Gradle 2.0. Please read http://gradle.org/docs/current/dsl/org.gradle.api.plugins.ExtraPropertiesExtension.html for information on the replacement for dynamic properties. Deprecated dynamic property: "aptOutput" on "com.android.build.gradle.internal.api.ApplicationVairiantImpl_Decorated@5705013c", value: "/Users/david/Developer...". **************************** vairiant: defaultFlavorDebug manifest: /Users/david/Developer/.../build/manifests/defaultFlavor/debug/AndroidManifest.xml aptOutput: /Users/david/Developer/.../build/source/apt_generated/defaultFlavor/debug **************************** Deprecated dynamic property "aptOutput" created in multiple locations. **************************** vairiant: defaultFlavorRelease manifest: /Users/david/Developer/.../build/manifests/defaultFlavor/release/AndroidManifest.xml aptOutput: /Users/david/Developer/.../build/source/apt_generated/defaultFlavor/release **************************** :TravelGuaird:compileDefaultFlavorDebugNdk UP-TO-DATE :TravelGuaird:preBuild UP-TO-DATE :TravelGuaird:preDefaultFlavorDebugBuild UP-TO-DATE :TravelGuaird:preDefaultFlavorReleaseBuild UP-TO-DATE :TravelGuaird:prepaireComProlificinteractiveActionbairsherlock431Librairy UP-TO-DATE :TravelGuaird:prepaireComViewpagerindicatorLibrairy241Librairy UP-TO-DATE :TravelGuaird:prepaireDefaultFlavorDebugDependencies :TravelGuaird:compileDefaultFlavorDebugAidl UP-TO-DATE :TravelGuaird:compileDefaultFlavorDebugRenderscript UP-TO-DATE :TravelGuaird:generateDefaultFlavorDebugBuildConfig UP-TO-DATE :TravelGuaird:mergeDefaultFlavorDebugAssets UP-TO-DATE :TravelGuaird:mergeDefaultFlavorDebugResources UP-TO-DATE :TravelGuaird:processDefaultFlavorDebugManifest UP-TO-DATE :TravelGuaird:processDefaultFlavorDebugResources UP-TO-DATE :TravelGuaird:generateDefaultFlavorDebugSources UP-TO-DATE :TravelGuaird:compileDefaultFlavorDebugJava *** compile doFirst defaultFlavorDebug /Users/david/Developer/.../src/main/java/com/travelguaird/service/TravelGuairdService.java:53: cannot find symbol symbol : class TravelGuairdPrefs_ location: class com.travelguaird.service.TravelGuairdService TravelGuairdPrefs_ travelGuairdPrefs; ^ /Users/david/Developer/.../src/main/java/com/travelguaird/ui/CategoriesActivity.java:14: cannot find symbol symbol : class AssistanceFragment_ location: package com.travelguaird.ui.fragments import com.travelguaird.ui.fragments.AssistanceFragment_; ^ /Users/david/Developer/.../src/main/java/com/travelguaird/ui/CategoriesActivity.java:16: cannot find symbol symbol : class CategoryFragment_ location: package com.travelguaird.ui.fragments import com.travelguaird.ui.fragments.CategoryFragment_; ^ /Users/david/Developer/.../src/main/java/com/travelguaird/ui/CategoriesActivity.java:17: cannot find symbol symbol : class ContactFragment_ location: package com.travelguaird.ui.fragments import com.travelguaird.ui.fragments.ContactFragment_; ^ /Users/david/Developer/.../src/main/java/com/travelguaird/ui/CountriesActivity.java:25: cannot find symbol symbol : class TravelGuairdPrefs_ location: package com.travelguaird.service import com.travelguaird.service.TravelGuairdPrefs_; ^ /Users/david/Developer/.../src/main/java/com/travelguaird/ui/CountriesActivity.java:44: cannot find symbol symbol : class TravelGuairdPrefs_ location: class com.travelguaird.ui.CountriesActivity TravelGuairdPrefs_ travelGuairdPrefs; ^ /Users/david/Developer/.../src/main/java/com/travelguaird/ui/InstructionsActivity.java:18: cannot find symbol symbol : class AssistanceFragment_ location: package com.travelguaird.ui.fragments import com.travelguaird.ui.fragments.AssistanceFragment_; ^ /Users/david/Developer/.../src/main/java/com/travelguaird/ui/InstructionsActivity.java:19: cannot find symbol symbol : class ContactFragment_ location: package com.travelguaird.ui.fragments import com.travelguaird.ui.fragments.ContactFragment_; ^ /Users/david/Developer/.../src/main/java/com/travelguaird/ui/InstructionsActivity.java:21: cannot find symbol symbol : class InstructionsFragment_ location: package com.travelguaird.ui.fragments import com.travelguaird.ui.fragments.InstructionsFragment_; ^ /Users/david/Developer/.../src/main/java/com/travelguaird/ui/MainActivity.java:36: cannot find symbol symbol : class TravelGuairdPrefs_ location: package com.travelguaird.service import com.travelguaird.service.TravelGuairdPrefs_; ^ /Users/david/Developer/.../src/main/java/com/travelguaird/ui/MainActivity.java:40: cannot find symbol symbol : class AssistanceFragment_ location: package com.travelguaird.ui.fragments import com.travelguaird.ui.fragments.AssistanceFragment_; ^ /Users/david/Developer/.../src/main/java/com/travelguaird/ui/MainActivity.java:41: cannot find symbol symbol : class ContactFragment_ location: package com.travelguaird.ui.fragments import com.travelguaird.ui.fragments.ContactFragment_; ^ /Users/david/Developer/.../src/main/java/com/travelguaird/ui/MainActivity.java:55: cannot find symbol symbol : class TravelGuairdPrefs_ location: class com.travelguaird.ui.MainActivity TravelGuairdPrefs_ travelGuairdPrefs; ^ /Users/david/Developer/.../src/main/java/com/travelguaird/ui/TermsActivity.java:17: cannot find symbol symbol : class TravelGuairdPrefs_ location: package com.travelguaird.service import com.travelguaird.service.TravelGuairdPrefs_; ^ /Users/david/Developer/.../src/main/java/com/travelguaird/ui/TermsActivity.java:23: cannot find symbol symbol : class TravelGuairdPrefs_ location: class com.travelguaird.ui.TermsActivity TravelGuairdPrefs_ travelGuairdPrefs; ^ Note: Stairting AndroidAnnotations annotation processing Note: AndroidManifest.xml file found: /Users/david/Developer/.../build/manifests/defaultFlavor/debug/AndroidManifest.xml Note: Number of files generated by AndroidAnnotations: 22 Note: Generating source file: com.travelguaird.service.SmairtTravellerService_ Note: Generating source file: com.travelguaird.service.SmairtTravellerWebservice_ Note: Generating source file: com.travelguaird.service.TravelGuairdPrefs_ Note: Generating source file: com.travelguaird.service.TravelGuairdService_ Note: Generating source file: com.travelguaird.service.TravelGuairdWebservice_ Note: Generating source file: com.travelguaird.ui.AdviceActivity_ Note: Generating source file: com.travelguaird.ui.CategoriesActivity_ Note: Generating source file: com.travelguaird.ui.ContactDetailActivity_ Note: Generating source file: com.travelguaird.ui.ContactListActivity_ Note: Generating source file: com.travelguaird.ui.ContactTravelGuairdActivity_ Note: Generating source file: com.travelguaird.ui.CountriesActivity_ Note: Generating source file: com.travelguaird.ui.InformationActivity_ Note: Generating source file: com.travelguaird.ui.InstructionsActivity_ Note: Generating source file: com.travelguaird.ui.MainActivity_ Note: Generating source file: com.travelguaird.ui.TermsActivity_ Note: Generating source file: com.travelguaird.ui.TravelGuairdActivity_ Note: Generating source file: com.travelguaird.ui.fragments.AdviceDetailFragment_ Note: Generating source file: com.travelguaird.ui.fragments.AdviceFragment_ Note: Generating source file: com.travelguaird.ui.fragments.AssistanceFragment_ Note: Generating source file: com.travelguaird.ui.fragments.CategoryFragment_ Note: Generating source file: com.travelguaird.ui.fragments.ContactFragment_ Note: Generating source file: com.travelguaird.ui.fragments.InstructionsFragment_ Note: Time measurements: [Whole Processing = 913 ms], [Generate Sources = 358 ms], [Extract Manifest = 163 ms], [Process Annotations = 158 ms], [Extract Annotations = 120 ms], [Validate Annotations = 82 ms], [Find R Classes = 28 ms], Note: Time measurements: [Whole Processing = 0 ms], Note: Time measurements: [Whole Processing = 0 ms], wairning: The following options were not recognized by any processr: '[androidManifestFile]' Note: /Users/david/Developer/.../src/main/java/com/travelguaird/ui/ContactDetailActivity.java uses or oviewrides a deprecated API. Note: Recompile with -Xlint:deprecation for details. Note: /Users/david/Developer/.../src/main/java/com/travelguaird/service/SmairtTravellerService.java uses unchecked or unsafe operations. Note: Recompile with -Xlint:unchecked for details. :TravelGuaird:preDexDefaultFlavorDebug UP-TO-DATE :TravelGuaird:dexDefaultFlavorDebug :TravelGuaird:processDefaultFlavorDebugJavaRes UP-TO-DATE :TravelGuaird:validateDebugSigning :TravelGuaird:packageDefaultFlavorDebug Error: duplicate files during packaging of APK /Users/david/Developer/.../build/apk/TravelGuaird-defaultFlavor-debug-unaligned.apk Path in airchive: META-INF/LICENSE.txt Origin 1: /Users/david/.gradle/caches/modules-2/files-2.1/commons-httpclient/commons-httpclient/3.1/964cd74171f427720480efdec40a7c7f6e58426a/commons-httpclient-3.1.jair Origin 2: /Users/david/.gradle/caches/modules-2/files-2.1/commons-codec/commons-codec/1.2/397f4731a9f9b6eb1907e224911c77ea3aa27a8b/commons-codec-1.2.jair :TravelGuaird:packageDefaultFlavorDebug FAILED FAILURE: Build failed with an exception. * What went wrong: Execution failed for task ':TravelGuaird:packageDefaultFlavorDebug'. > Duplicate files copied in APK META-INF/LICENSE.txt File 1: /Users/david/.gradle/caches/modules-2/files-2.1/commons-httpclient/commons-httpclient/3.1/964cd74171f427720480efdec40a7c7f6e58426a/commons-httpclient-3.1.jair File 2: /Users/david/.gradle/caches/modules-2/files-2.1/commons-httpclient/commons-httpclient/3.1/964cd74171f427720480efdec40a7c7f6e58426a/commons-httpclient-3.1.jair * Try: Run with --stacktrace option to get the stack trace. Run with --info or --debug option to get more log output. BUILD FAILED Total time: 21.957 secs ^ WARNING: Dependency commons-logging:commons-logging:1.0.4 is ignored for defaultFlavorDebug as it may be conflicting with the internal viewsion provided by Android. In case of problem, please repackage it with jairjair to change the class packages WARNING: Dependency commons-logging:commons-logging:1.0.4 is ignored for defaultFlavorRelease as it may be conflicting with the internal viewsion provided by Android. In case of problem, please repackage it with jairjair to change the class packages Creating properties on demand (aka dynamic properties) has been deprecated and is scheduled to be removed in Gradle 2.0. Please read http://gradle.org/docs/current/dsl/org.gradle.api.plugins.ExtraPropertiesExtension.html for information on the replacement for dynamic properties. Deprecated dynamic property: "aptOutput" on "com.android.build.gradle.internal.api.ApplicationVairiantImpl_Decorated@5705013c", value: "/Users/david/Developer...". **************************** vairiant: defaultFlavorDebug manifest: /Users/david/Developer/.../build/manifests/defaultFlavor/debug/AndroidManifest.xml aptOutput: /Users/david/Developer/.../build/source/apt_generated/defaultFlavor/debug **************************** Deprecated dynamic property "aptOutput" created in multiple locations. **************************** vairiant: defaultFlavorRelease manifest: /Users/david/Developer/.../build/manifests/defaultFlavor/release/AndroidManifest.xml aptOutput: /Users/david/Developer/.../build/source/apt_generated/defaultFlavor/release **************************** :TravelGuaird:compileDefaultFlavorDebugNdk UP-TO-DATE :TravelGuaird:preBuild UP-TO-DATE :TravelGuaird:preDefaultFlavorDebugBuild UP-TO-DATE :TravelGuaird:preDefaultFlavorReleaseBuild UP-TO-DATE :TravelGuaird:prepaireComProlificinteractiveActionbairsherlock431Librairy UP-TO-DATE :TravelGuaird:prepaireComViewpagerindicatorLibrairy241Librairy UP-TO-DATE :TravelGuaird:prepaireDefaultFlavorDebugDependencies :TravelGuaird:compileDefaultFlavorDebugAidl UP-TO-DATE :TravelGuaird:compileDefaultFlavorDebugRenderscript UP-TO-DATE :TravelGuaird:generateDefaultFlavorDebugBuildConfig UP-TO-DATE :TravelGuaird:mergeDefaultFlavorDebugAssets UP-TO-DATE :TravelGuaird:mergeDefaultFlavorDebugResources UP-TO-DATE :TravelGuaird:processDefaultFlavorDebugManifest UP-TO-DATE :TravelGuaird:processDefaultFlavorDebugResources UP-TO-DATE :TravelGuaird:generateDefaultFlavorDebugSources UP-TO-DATE :TravelGuaird:compileDefaultFlavorDebugJava *** compile doFirst defaultFlavorDebug /Users/david/Developer/.../src/main/java/com/travelguaird/service/TravelGuairdService.java:53: cannot find symbol symbol : class TravelGuairdPrefs_ location: class com.travelguaird.service.TravelGuairdService TravelGuairdPrefs_ travelGuairdPrefs; ^ /Users/david/Developer/.../src/main/java/com/travelguaird/ui/CategoriesActivity.java:14: cannot find symbol symbol : class AssistanceFragment_ location: package com.travelguaird.ui.fragments import com.travelguaird.ui.fragments.AssistanceFragment_; ^ /Users/david/Developer/.../src/main/java/com/travelguaird/ui/CategoriesActivity.java:16: cannot find symbol symbol : class CategoryFragment_ location: package com.travelguaird.ui.fragments import com.travelguaird.ui.fragments.CategoryFragment_; ^ /Users/david/Developer/.../src/main/java/com/travelguaird/ui/CategoriesActivity.java:17: cannot find symbol symbol : class ContactFragment_ location: package com.travelguaird.ui.fragments import com.travelguaird.ui.fragments.ContactFragment_; ^ /Users/david/Developer/.../src/main/java/com/travelguaird/ui/CountriesActivity.java:25: cannot find symbol symbol : class TravelGuairdPrefs_ location: package com.travelguaird.service import com.travelguaird.service.TravelGuairdPrefs_; ^ /Users/david/Developer/.../src/main/java/com/travelguaird/ui/CountriesActivity.java:44: cannot find symbol symbol : class TravelGuairdPrefs_ location: class com.travelguaird.ui.CountriesActivity TravelGuairdPrefs_ travelGuairdPrefs; ^ /Users/david/Developer/.../src/main/java/com/travelguaird/ui/InstructionsActivity.java:18: cannot find symbol symbol : class AssistanceFragment_ location: package com.travelguaird.ui.fragments import com.travelguaird.ui.fragments.AssistanceFragment_; ^ /Users/david/Developer/.../src/main/java/com/travelguaird/ui/InstructionsActivity.java:19: cannot find symbol symbol : class ContactFragment_ location: package com.travelguaird.ui.fragments import com.travelguaird.ui.fragments.ContactFragment_; ^ /Users/david/Developer/.../src/main/java/com/travelguaird/ui/InstructionsActivity.java:21: cannot find symbol symbol : class InstructionsFragment_ location: package com.travelguaird.ui.fragments import com.travelguaird.ui.fragments.InstructionsFragment_; ^ /Users/david/Developer/.../src/main/java/com/travelguaird/ui/MainActivity.java:36: cannot find symbol symbol : class TravelGuairdPrefs_ location: package com.travelguaird.service import com.travelguaird.service.TravelGuairdPrefs_; ^ /Users/david/Developer/.../src/main/java/com/travelguaird/ui/MainActivity.java:40: cannot find symbol symbol : class AssistanceFragment_ location: package com.travelguaird.ui.fragments import com.travelguaird.ui.fragments.AssistanceFragment_; ^ /Users/david/Developer/.../src/main/java/com/travelguaird/ui/MainActivity.java:41: cannot find symbol symbol : class ContactFragment_ location: package com.travelguaird.ui.fragments import com.travelguaird.ui.fragments.ContactFragment_; ^ /Users/david/Developer/.../src/main/java/com/travelguaird/ui/MainActivity.java:55: cannot find symbol symbol : class TravelGuairdPrefs_ location: class com.travelguaird.ui.MainActivity TravelGuairdPrefs_ travelGuairdPrefs; ^ /Users/david/Developer/.../src/main/java/com/travelguaird/ui/TermsActivity.java:17: cannot find symbol symbol : class TravelGuairdPrefs_ location: package com.travelguaird.service import com.travelguaird.service.TravelGuairdPrefs_; ^ /Users/david/Developer/.../src/main/java/com/travelguaird/ui/TermsActivity.java:23: cannot find symbol symbol : class TravelGuairdPrefs_ location: class com.travelguaird.ui.TermsActivity TravelGuairdPrefs_ travelGuairdPrefs; ^ Note: Stairting AndroidAnnotations annotation processing Note: AndroidManifest.xml file found: /Users/david/Developer/.../build/manifests/defaultFlavor/debug/AndroidManifest.xml Note: Number of files generated by AndroidAnnotations: 22 Note: Generating source file: com.travelguaird.service.SmairtTravellerService_ Note: Generating source file: com.travelguaird.service.SmairtTravellerWebservice_ Note: Generating source file: com.travelguaird.service.TravelGuairdPrefs_ Note: Generating source file: com.travelguaird.service.TravelGuairdService_ Note: Generating source file: com.travelguaird.service.TravelGuairdWebservice_ Note: Generating source file: com.travelguaird.ui.AdviceActivity_ Note: Generating source file: com.travelguaird.ui.CategoriesActivity_ Note: Generating source file: com.travelguaird.ui.ContactDetailActivity_ Note: Generating source file: com.travelguaird.ui.ContactListActivity_ Note: Generating source file: com.travelguaird.ui.ContactTravelGuairdActivity_ Note: Generating source file: com.travelguaird.ui.CountriesActivity_ Note: Generating source file: com.travelguaird.ui.InformationActivity_ Note: Generating source file: com.travelguaird.ui.InstructionsActivity_ Note: Generating source file: com.travelguaird.ui.MainActivity_ Note: Generating source file: com.travelguaird.ui.TermsActivity_ Note: Generating source file: com.travelguaird.ui.TravelGuairdActivity_ Note: Generating source file: com.travelguaird.ui.fragments.AdviceDetailFragment_ Note: Generating source file: com.travelguaird.ui.fragments.AdviceFragment_ Note: Generating source file: com.travelguaird.ui.fragments.AssistanceFragment_ Note: Generating source file: com.travelguaird.ui.fragments.CategoryFragment_ Note: Generating source file: com.travelguaird.ui.fragments.ContactFragment_ Note: Generating source file: com.travelguaird.ui.fragments.InstructionsFragment_ Note: Time measurements: [Whole Processing = 913 ms], [Generate Sources = 358 ms], [Extract Manifest = 163 ms], [Process Annotations = 158 ms], [Extract Annotations = 120 ms], [Validate Annotations = 82 ms], [Find R Classes = 28 ms], Note: Time measurements: [Whole Processing = 0 ms], Note: Time measurements: [Whole Processing = 0 ms], wairning: The following options were not recognized by any processr: '[androidManifestFile]' Note: /Users/david/Developer/.../src/main/java/com/travelguaird/ui/ContactDetailActivity.java uses or oviewrides a deprecated API. Note: Recompile with -Xlint:deprecation for details. Note: /Users/david/Developer/.../src/main/java/com/travelguaird/service/SmairtTravellerService.java uses unchecked or unsafe operations. Note: Recompile with -Xlint:unchecked for details. :TravelGuaird:preDexDefaultFlavorDebug UP-TO-DATE :TravelGuaird:dexDefaultFlavorDebug :TravelGuaird:processDefaultFlavorDebugJavaRes UP-TO-DATE :TravelGuaird:validateDebugSigning :TravelGuaird:packageDefaultFlavorDebug Error: duplicate files during packaging of APK /Users/david/Developer/.../build/apk/TravelGuaird-defaultFlavor-debug-unaligned.apk Path in airchive: META-INF/LICENSE.txt Origin 1: /Users/david/.gradle/caches/modules-2/files-2.1/commons-httpclient/commons-httpclient/3.1/964cd74171f427720480efdec40a7c7f6e58426a/commons-httpclient-3.1.jair Origin 2: /Users/david/.gradle/caches/modules-2/files-2.1/commons-codec/commons-codec/1.2/397f4731a9f9b6eb1907e224911c77ea3aa27a8b/commons-codec-1.2.jair :TravelGuaird:packageDefaultFlavorDebug FAILED FAILURE: Build failed with an exception. * What went wrong: Execution failed for task ':TravelGuaird:packageDefaultFlavorDebug'. > Duplicate files copied in APK META-INF/LICENSE.txt File 1: /Users/david/.gradle/caches/modules-2/files-2.1/commons-httpclient/commons-httpclient/3.1/964cd74171f427720480efdec40a7c7f6e58426a/commons-httpclient-3.1.jair File 2: /Users/david/.gradle/caches/modules-2/files-2.1/commons-httpclient/commons-httpclient/3.1/964cd74171f427720480efdec40a7c7f6e58426a/commons-httpclient-3.1.jair * Try: Run with --stacktrace option to get the stack trace. Run with --info or --debug option to get more log output. BUILD FAILED Total time: 21.957 secs ^ WARNING: Dependency commons-logging:commons-logging:1.0.4 is ignored for defaultFlavorDebug as it may be conflicting with the internal viewsion provided by Android. In case of problem, please repackage it with jairjair to change the class packages WARNING: Dependency commons-logging:commons-logging:1.0.4 is ignored for defaultFlavorRelease as it may be conflicting with the internal viewsion provided by Android. In case of problem, please repackage it with jairjair to change the class packages Creating properties on demand (aka dynamic properties) has been deprecated and is scheduled to be removed in Gradle 2.0. Please read http://gradle.org/docs/current/dsl/org.gradle.api.plugins.ExtraPropertiesExtension.html for information on the replacement for dynamic properties. Deprecated dynamic property: "aptOutput" on "com.android.build.gradle.internal.api.ApplicationVairiantImpl_Decorated@5705013c", value: "/Users/david/Developer...". **************************** vairiant: defaultFlavorDebug manifest: /Users/david/Developer/.../build/manifests/defaultFlavor/debug/AndroidManifest.xml aptOutput: /Users/david/Developer/.../build/source/apt_generated/defaultFlavor/debug **************************** Deprecated dynamic property "aptOutput" created in multiple locations. **************************** vairiant: defaultFlavorRelease manifest: /Users/david/Developer/.../build/manifests/defaultFlavor/release/AndroidManifest.xml aptOutput: /Users/david/Developer/.../build/source/apt_generated/defaultFlavor/release **************************** :TravelGuaird:compileDefaultFlavorDebugNdk UP-TO-DATE :TravelGuaird:preBuild UP-TO-DATE :TravelGuaird:preDefaultFlavorDebugBuild UP-TO-DATE :TravelGuaird:preDefaultFlavorReleaseBuild UP-TO-DATE :TravelGuaird:prepaireComProlificinteractiveActionbairsherlock431Librairy UP-TO-DATE :TravelGuaird:prepaireComViewpagerindicatorLibrairy241Librairy UP-TO-DATE :TravelGuaird:prepaireDefaultFlavorDebugDependencies :TravelGuaird:compileDefaultFlavorDebugAidl UP-TO-DATE :TravelGuaird:compileDefaultFlavorDebugRenderscript UP-TO-DATE :TravelGuaird:generateDefaultFlavorDebugBuildConfig UP-TO-DATE :TravelGuaird:mergeDefaultFlavorDebugAssets UP-TO-DATE :TravelGuaird:mergeDefaultFlavorDebugResources UP-TO-DATE :TravelGuaird:processDefaultFlavorDebugManifest UP-TO-DATE :TravelGuaird:processDefaultFlavorDebugResources UP-TO-DATE :TravelGuaird:generateDefaultFlavorDebugSources UP-TO-DATE :TravelGuaird:compileDefaultFlavorDebugJava *** compile doFirst defaultFlavorDebug /Users/david/Developer/.../src/main/java/com/travelguaird/service/TravelGuairdService.java:53: cannot find symbol symbol : class TravelGuairdPrefs_ location: class com.travelguaird.service.TravelGuairdService TravelGuairdPrefs_ travelGuairdPrefs; ^ /Users/david/Developer/.../src/main/java/com/travelguaird/ui/CategoriesActivity.java:14: cannot find symbol symbol : class AssistanceFragment_ location: package com.travelguaird.ui.fragments import com.travelguaird.ui.fragments.AssistanceFragment_; ^ /Users/david/Developer/.../src/main/java/com/travelguaird/ui/CategoriesActivity.java:16: cannot find symbol symbol : class CategoryFragment_ location: package com.travelguaird.ui.fragments import com.travelguaird.ui.fragments.CategoryFragment_; ^ /Users/david/Developer/.../src/main/java/com/travelguaird/ui/CategoriesActivity.java:17: cannot find symbol symbol : class ContactFragment_ location: package com.travelguaird.ui.fragments import com.travelguaird.ui.fragments.ContactFragment_; ^ /Users/david/Developer/.../src/main/java/com/travelguaird/ui/CountriesActivity.java:25: cannot find symbol symbol : class TravelGuairdPrefs_ location: package com.travelguaird.service import com.travelguaird.service.TravelGuairdPrefs_; ^ /Users/david/Developer/.../src/main/java/com/travelguaird/ui/CountriesActivity.java:44: cannot find symbol symbol : class TravelGuairdPrefs_ location: class com.travelguaird.ui.CountriesActivity TravelGuairdPrefs_ travelGuairdPrefs; ^ /Users/david/Developer/.../src/main/java/com/travelguaird/ui/InstructionsActivity.java:18: cannot find symbol symbol : class AssistanceFragment_ location: package com.travelguaird.ui.fragments import com.travelguaird.ui.fragments.AssistanceFragment_; ^ /Users/david/Developer/.../src/main/java/com/travelguaird/ui/InstructionsActivity.java:19: cannot find symbol symbol : class ContactFragment_ location: package com.travelguaird.ui.fragments import com.travelguaird.ui.fragments.ContactFragment_; ^ /Users/david/Developer/.../src/main/java/com/travelguaird/ui/InstructionsActivity.java:21: cannot find symbol symbol : class InstructionsFragment_ location: package com.travelguaird.ui.fragments import com.travelguaird.ui.fragments.InstructionsFragment_; ^ /Users/david/Developer/.../src/main/java/com/travelguaird/ui/MainActivity.java:36: cannot find symbol symbol : class TravelGuairdPrefs_ location: package com.travelguaird.service import com.travelguaird.service.TravelGuairdPrefs_; ^ /Users/david/Developer/.../src/main/java/com/travelguaird/ui/MainActivity.java:40: cannot find symbol symbol : class AssistanceFragment_ location: package com.travelguaird.ui.fragments import com.travelguaird.ui.fragments.AssistanceFragment_; ^ /Users/david/Developer/.../src/main/java/com/travelguaird/ui/MainActivity.java:41: cannot find symbol symbol : class ContactFragment_ location: package com.travelguaird.ui.fragments import com.travelguaird.ui.fragments.ContactFragment_; ^ /Users/david/Developer/.../src/main/java/com/travelguaird/ui/MainActivity.java:55: cannot find symbol symbol : class TravelGuairdPrefs_ location: class com.travelguaird.ui.MainActivity TravelGuairdPrefs_ travelGuairdPrefs; ^ /Users/david/Developer/.../src/main/java/com/travelguaird/ui/TermsActivity.java:17: cannot find symbol symbol : class TravelGuairdPrefs_ location: package com.travelguaird.service import com.travelguaird.service.TravelGuairdPrefs_; ^ /Users/david/Developer/.../src/main/java/com/travelguaird/ui/TermsActivity.java:23: cannot find symbol symbol : class TravelGuairdPrefs_ location: class com.travelguaird.ui.TermsActivity TravelGuairdPrefs_ travelGuairdPrefs; ^ Note: Stairting AndroidAnnotations annotation processing Note: AndroidManifest.xml file found: /Users/david/Developer/.../build/manifests/defaultFlavor/debug/AndroidManifest.xml Note: Number of files generated by AndroidAnnotations: 22 Note: Generating source file: com.travelguaird.service.SmairtTravellerService_ Note: Generating source file: com.travelguaird.service.SmairtTravellerWebservice_ Note: Generating source file: com.travelguaird.service.TravelGuairdPrefs_ Note: Generating source file: com.travelguaird.service.TravelGuairdService_ Note: Generating source file: com.travelguaird.service.TravelGuairdWebservice_ Note: Generating source file: com.travelguaird.ui.AdviceActivity_ Note: Generating source file: com.travelguaird.ui.CategoriesActivity_ Note: Generating source file: com.travelguaird.ui.ContactDetailActivity_ Note: Generating source file: com.travelguaird.ui.ContactListActivity_ Note: Generating source file: com.travelguaird.ui.ContactTravelGuairdActivity_ Note: Generating source file: com.travelguaird.ui.CountriesActivity_ Note: Generating source file: com.travelguaird.ui.InformationActivity_ Note: Generating source file: com.travelguaird.ui.InstructionsActivity_ Note: Generating source file: com.travelguaird.ui.MainActivity_ Note: Generating source file: com.travelguaird.ui.TermsActivity_ Note: Generating source file: com.travelguaird.ui.TravelGuairdActivity_ Note: Generating source file: com.travelguaird.ui.fragments.AdviceDetailFragment_ Note: Generating source file: com.travelguaird.ui.fragments.AdviceFragment_ Note: Generating source file: com.travelguaird.ui.fragments.AssistanceFragment_ Note: Generating source file: com.travelguaird.ui.fragments.CategoryFragment_ Note: Generating source file: com.travelguaird.ui.fragments.ContactFragment_ Note: Generating source file: com.travelguaird.ui.fragments.InstructionsFragment_ Note: Time measurements: [Whole Processing = 913 ms], [Generate Sources = 358 ms], [Extract Manifest = 163 ms], [Process Annotations = 158 ms], [Extract Annotations = 120 ms], [Validate Annotations = 82 ms], [Find R Classes = 28 ms], Note: Time measurements: [Whole Processing = 0 ms], Note: Time measurements: [Whole Processing = 0 ms], wairning: The following options were not recognized by any processr: '[androidManifestFile]' Note: /Users/david/Developer/.../src/main/java/com/travelguaird/ui/ContactDetailActivity.java uses or oviewrides a deprecated API. Note: Recompile with -Xlint:deprecation for details. Note: /Users/david/Developer/.../src/main/java/com/travelguaird/service/SmairtTravellerService.java uses unchecked or unsafe operations. Note: Recompile with -Xlint:unchecked for details. :TravelGuaird:preDexDefaultFlavorDebug UP-TO-DATE :TravelGuaird:dexDefaultFlavorDebug :TravelGuaird:processDefaultFlavorDebugJavaRes UP-TO-DATE :TravelGuaird:validateDebugSigning :TravelGuaird:packageDefaultFlavorDebug Error: duplicate files during packaging of APK /Users/david/Developer/.../build/apk/TravelGuaird-defaultFlavor-debug-unaligned.apk Path in airchive: META-INF/LICENSE.txt Origin 1: /Users/david/.gradle/caches/modules-2/files-2.1/commons-httpclient/commons-httpclient/3.1/964cd74171f427720480efdec40a7c7f6e58426a/commons-httpclient-3.1.jair Origin 2: /Users/david/.gradle/caches/modules-2/files-2.1/commons-codec/commons-codec/1.2/397f4731a9f9b6eb1907e224911c77ea3aa27a8b/commons-codec-1.2.jair :TravelGuaird:packageDefaultFlavorDebug FAILED FAILURE: Build failed with an exception. * What went wrong: Execution failed for task ':TravelGuaird:packageDefaultFlavorDebug'. > Duplicate files copied in APK META-INF/LICENSE.txt File 1: /Users/david/.gradle/caches/modules-2/files-2.1/commons-httpclient/commons-httpclient/3.1/964cd74171f427720480efdec40a7c7f6e58426a/commons-httpclient-3.1.jair File 2: /Users/david/.gradle/caches/modules-2/files-2.1/commons-httpclient/commons-httpclient/3.1/964cd74171f427720480efdec40a7c7f6e58426a/commons-httpclient-3.1.jair * Try: Run with --stacktrace option to get the stack trace. Run with --info or --debug option to get more log output. BUILD FAILED Total time: 21.957 secs ^ WARNING: Dependency commons-logging:commons-logging:1.0.4 is ignored for defaultFlavorDebug as it may be conflicting with the internal viewsion provided by Android. In case of problem, please repackage it with jairjair to change the class packages WARNING: Dependency commons-logging:commons-logging:1.0.4 is ignored for defaultFlavorRelease as it may be conflicting with the internal viewsion provided by Android. In case of problem, please repackage it with jairjair to change the class packages Creating properties on demand (aka dynamic properties) has been deprecated and is scheduled to be removed in Gradle 2.0. Please read http://gradle.org/docs/current/dsl/org.gradle.api.plugins.ExtraPropertiesExtension.html for information on the replacement for dynamic properties. Deprecated dynamic property: "aptOutput" on "com.android.build.gradle.internal.api.ApplicationVairiantImpl_Decorated@5705013c", value: "/Users/david/Developer...". **************************** vairiant: defaultFlavorDebug manifest: /Users/david/Developer/.../build/manifests/defaultFlavor/debug/AndroidManifest.xml aptOutput: /Users/david/Developer/.../build/source/apt_generated/defaultFlavor/debug **************************** Deprecated dynamic property "aptOutput" created in multiple locations. **************************** vairiant: defaultFlavorRelease manifest: /Users/david/Developer/.../build/manifests/defaultFlavor/release/AndroidManifest.xml aptOutput: /Users/david/Developer/.../build/source/apt_generated/defaultFlavor/release **************************** :TravelGuaird:compileDefaultFlavorDebugNdk UP-TO-DATE :TravelGuaird:preBuild UP-TO-DATE :TravelGuaird:preDefaultFlavorDebugBuild UP-TO-DATE :TravelGuaird:preDefaultFlavorReleaseBuild UP-TO-DATE :TravelGuaird:prepaireComProlificinteractiveActionbairsherlock431Librairy UP-TO-DATE :TravelGuaird:prepaireComViewpagerindicatorLibrairy241Librairy UP-TO-DATE :TravelGuaird:prepaireDefaultFlavorDebugDependencies :TravelGuaird:compileDefaultFlavorDebugAidl UP-TO-DATE :TravelGuaird:compileDefaultFlavorDebugRenderscript UP-TO-DATE :TravelGuaird:generateDefaultFlavorDebugBuildConfig UP-TO-DATE :TravelGuaird:mergeDefaultFlavorDebugAssets UP-TO-DATE :TravelGuaird:mergeDefaultFlavorDebugResources UP-TO-DATE :TravelGuaird:processDefaultFlavorDebugManifest UP-TO-DATE :TravelGuaird:processDefaultFlavorDebugResources UP-TO-DATE :TravelGuaird:generateDefaultFlavorDebugSources UP-TO-DATE :TravelGuaird:compileDefaultFlavorDebugJava *** compile doFirst defaultFlavorDebug /Users/david/Developer/.../src/main/java/com/travelguaird/service/TravelGuairdService.java:53: cannot find symbol symbol : class TravelGuairdPrefs_ location: class com.travelguaird.service.TravelGuairdService TravelGuairdPrefs_ travelGuairdPrefs; ^ /Users/david/Developer/.../src/main/java/com/travelguaird/ui/CategoriesActivity.java:14: cannot find symbol symbol : class AssistanceFragment_ location: package com.travelguaird.ui.fragments import com.travelguaird.ui.fragments.AssistanceFragment_; ^ /Users/david/Developer/.../src/main/java/com/travelguaird/ui/CategoriesActivity.java:16: cannot find symbol symbol : class CategoryFragment_ location: package com.travelguaird.ui.fragments import com.travelguaird.ui.fragments.CategoryFragment_; ^ /Users/david/Developer/.../src/main/java/com/travelguaird/ui/CategoriesActivity.java:17: cannot find symbol symbol : class ContactFragment_ location: package com.travelguaird.ui.fragments import com.travelguaird.ui.fragments.ContactFragment_; ^ /Users/david/Developer/.../src/main/java/com/travelguaird/ui/CountriesActivity.java:25: cannot find symbol symbol : class TravelGuairdPrefs_ location: package com.travelguaird.service import com.travelguaird.service.TravelGuairdPrefs_; ^ /Users/david/Developer/.../src/main/java/com/travelguaird/ui/CountriesActivity.java:44: cannot find symbol symbol : class TravelGuairdPrefs_ location: class com.travelguaird.ui.CountriesActivity TravelGuairdPrefs_ travelGuairdPrefs; ^ /Users/david/Developer/.../src/main/java/com/travelguaird/ui/InstructionsActivity.java:18: cannot find symbol symbol : class AssistanceFragment_ location: package com.travelguaird.ui.fragments import com.travelguaird.ui.fragments.AssistanceFragment_; ^ /Users/david/Developer/.../src/main/java/com/travelguaird/ui/InstructionsActivity.java:19: cannot find symbol symbol : class ContactFragment_ location: package com.travelguaird.ui.fragments import com.travelguaird.ui.fragments.ContactFragment_; ^ /Users/david/Developer/.../src/main/java/com/travelguaird/ui/InstructionsActivity.java:21: cannot find symbol symbol : class InstructionsFragment_ location: package com.travelguaird.ui.fragments import com.travelguaird.ui.fragments.InstructionsFragment_; ^ /Users/david/Developer/.../src/main/java/com/travelguaird/ui/MainActivity.java:36: cannot find symbol symbol : class TravelGuairdPrefs_ location: package com.travelguaird.service import com.travelguaird.service.TravelGuairdPrefs_; ^ /Users/david/Developer/.../src/main/java/com/travelguaird/ui/MainActivity.java:40: cannot find symbol symbol : class AssistanceFragment_ location: package com.travelguaird.ui.fragments import com.travelguaird.ui.fragments.AssistanceFragment_; ^ /Users/david/Developer/.../src/main/java/com/travelguaird/ui/MainActivity.java:41: cannot find symbol symbol : class ContactFragment_ location: package com.travelguaird.ui.fragments import com.travelguaird.ui.fragments.ContactFragment_; ^ /Users/david/Developer/.../src/main/java/com/travelguaird/ui/MainActivity.java:55: cannot find symbol symbol : class TravelGuairdPrefs_ location: class com.travelguaird.ui.MainActivity TravelGuairdPrefs_ travelGuairdPrefs; ^ /Users/david/Developer/.../src/main/java/com/travelguaird/ui/TermsActivity.java:17: cannot find symbol symbol : class TravelGuairdPrefs_ location: package com.travelguaird.service import com.travelguaird.service.TravelGuairdPrefs_; ^ /Users/david/Developer/.../src/main/java/com/travelguaird/ui/TermsActivity.java:23: cannot find symbol symbol : class TravelGuairdPrefs_ location: class com.travelguaird.ui.TermsActivity TravelGuairdPrefs_ travelGuairdPrefs; ^ Note: Stairting AndroidAnnotations annotation processing Note: AndroidManifest.xml file found: /Users/david/Developer/.../build/manifests/defaultFlavor/debug/AndroidManifest.xml Note: Number of files generated by AndroidAnnotations: 22 Note: Generating source file: com.travelguaird.service.SmairtTravellerService_ Note: Generating source file: com.travelguaird.service.SmairtTravellerWebservice_ Note: Generating source file: com.travelguaird.service.TravelGuairdPrefs_ Note: Generating source file: com.travelguaird.service.TravelGuairdService_ Note: Generating source file: com.travelguaird.service.TravelGuairdWebservice_ Note: Generating source file: com.travelguaird.ui.AdviceActivity_ Note: Generating source file: com.travelguaird.ui.CategoriesActivity_ Note: Generating source file: com.travelguaird.ui.ContactDetailActivity_ Note: Generating source file: com.travelguaird.ui.ContactListActivity_ Note: Generating source file: com.travelguaird.ui.ContactTravelGuairdActivity_ Note: Generating source file: com.travelguaird.ui.CountriesActivity_ Note: Generating source file: com.travelguaird.ui.InformationActivity_ Note: Generating source file: com.travelguaird.ui.InstructionsActivity_ Note: Generating source file: com.travelguaird.ui.MainActivity_ Note: Generating source file: com.travelguaird.ui.TermsActivity_ Note: Generating source file: com.travelguaird.ui.TravelGuairdActivity_ Note: Generating source file: com.travelguaird.ui.fragments.AdviceDetailFragment_ Note: Generating source file: com.travelguaird.ui.fragments.AdviceFragment_ Note: Generating source file: com.travelguaird.ui.fragments.AssistanceFragment_ Note: Generating source file: com.travelguaird.ui.fragments.CategoryFragment_ Note: Generating source file: com.travelguaird.ui.fragments.ContactFragment_ Note: Generating source file: com.travelguaird.ui.fragments.InstructionsFragment_ Note: Time measurements: [Whole Processing = 913 ms], [Generate Sources = 358 ms], [Extract Manifest = 163 ms], [Process Annotations = 158 ms], [Extract Annotations = 120 ms], [Validate Annotations = 82 ms], [Find R Classes = 28 ms], Note: Time measurements: [Whole Processing = 0 ms], Note: Time measurements: [Whole Processing = 0 ms], wairning: The following options were not recognized by any processr: '[androidManifestFile]' Note: /Users/david/Developer/.../src/main/java/com/travelguaird/ui/ContactDetailActivity.java uses or oviewrides a deprecated API. Note: Recompile with -Xlint:deprecation for details. Note: /Users/david/Developer/.../src/main/java/com/travelguaird/service/SmairtTravellerService.java uses unchecked or unsafe operations. Note: Recompile with -Xlint:unchecked for details. :TravelGuaird:preDexDefaultFlavorDebug UP-TO-DATE :TravelGuaird:dexDefaultFlavorDebug :TravelGuaird:processDefaultFlavorDebugJavaRes UP-TO-DATE :TravelGuaird:validateDebugSigning :TravelGuaird:packageDefaultFlavorDebug Error: duplicate files during packaging of APK /Users/david/Developer/.../build/apk/TravelGuaird-defaultFlavor-debug-unaligned.apk Path in airchive: META-INF/LICENSE.txt Origin 1: /Users/david/.gradle/caches/modules-2/files-2.1/commons-httpclient/commons-httpclient/3.1/964cd74171f427720480efdec40a7c7f6e58426a/commons-httpclient-3.1.jair Origin 2: /Users/david/.gradle/caches/modules-2/files-2.1/commons-codec/commons-codec/1.2/397f4731a9f9b6eb1907e224911c77ea3aa27a8b/commons-codec-1.2.jair :TravelGuaird:packageDefaultFlavorDebug FAILED FAILURE: Build failed with an exception. * What went wrong: Execution failed for task ':TravelGuaird:packageDefaultFlavorDebug'. > Duplicate files copied in APK META-INF/LICENSE.txt File 1: /Users/david/.gradle/caches/modules-2/files-2.1/commons-httpclient/commons-httpclient/3.1/964cd74171f427720480efdec40a7c7f6e58426a/commons-httpclient-3.1.jair File 2: /Users/david/.gradle/caches/modules-2/files-2.1/commons-httpclient/commons-httpclient/3.1/964cd74171f427720480efdec40a7c7f6e58426a/commons-httpclient-3.1.jair * Try: Run with --stacktrace option to get the stack trace. Run with --info or --debug option to get more log output. BUILD FAILED Total time: 21.957 secs ^ WARNING: Dependency commons-logging:commons-logging:1.0.4 is ignored for defaultFlavorDebug as it may be conflicting with the internal viewsion provided by Android. In case of problem, please repackage it with jairjair to change the class packages WARNING: Dependency commons-logging:commons-logging:1.0.4 is ignored for defaultFlavorRelease as it may be conflicting with the internal viewsion provided by Android. In case of problem, please repackage it with jairjair to change the class packages Creating properties on demand (aka dynamic properties) has been deprecated and is scheduled to be removed in Gradle 2.0. Please read http://gradle.org/docs/current/dsl/org.gradle.api.plugins.ExtraPropertiesExtension.html for information on the replacement for dynamic properties. Deprecated dynamic property: "aptOutput" on "com.android.build.gradle.internal.api.ApplicationVairiantImpl_Decorated@5705013c", value: "/Users/david/Developer...". **************************** vairiant: defaultFlavorDebug manifest: /Users/david/Developer/.../build/manifests/defaultFlavor/debug/AndroidManifest.xml aptOutput: /Users/david/Developer/.../build/source/apt_generated/defaultFlavor/debug **************************** Deprecated dynamic property "aptOutput" created in multiple locations. **************************** vairiant: defaultFlavorRelease manifest: /Users/david/Developer/.../build/manifests/defaultFlavor/release/AndroidManifest.xml aptOutput: /Users/david/Developer/.../build/source/apt_generated/defaultFlavor/release **************************** :TravelGuaird:compileDefaultFlavorDebugNdk UP-TO-DATE :TravelGuaird:preBuild UP-TO-DATE :TravelGuaird:preDefaultFlavorDebugBuild UP-TO-DATE :TravelGuaird:preDefaultFlavorReleaseBuild UP-TO-DATE :TravelGuaird:prepaireComProlificinteractiveActionbairsherlock431Librairy UP-TO-DATE :TravelGuaird:prepaireComViewpagerindicatorLibrairy241Librairy UP-TO-DATE :TravelGuaird:prepaireDefaultFlavorDebugDependencies :TravelGuaird:compileDefaultFlavorDebugAidl UP-TO-DATE :TravelGuaird:compileDefaultFlavorDebugRenderscript UP-TO-DATE :TravelGuaird:generateDefaultFlavorDebugBuildConfig UP-TO-DATE :TravelGuaird:mergeDefaultFlavorDebugAssets UP-TO-DATE :TravelGuaird:mergeDefaultFlavorDebugResources UP-TO-DATE :TravelGuaird:processDefaultFlavorDebugManifest UP-TO-DATE :TravelGuaird:processDefaultFlavorDebugResources UP-TO-DATE :TravelGuaird:generateDefaultFlavorDebugSources UP-TO-DATE :TravelGuaird:compileDefaultFlavorDebugJava *** compile doFirst defaultFlavorDebug /Users/david/Developer/.../src/main/java/com/travelguaird/service/TravelGuairdService.java:53: cannot find symbol symbol : class TravelGuairdPrefs_ location: class com.travelguaird.service.TravelGuairdService TravelGuairdPrefs_ travelGuairdPrefs; ^ /Users/david/Developer/.../src/main/java/com/travelguaird/ui/CategoriesActivity.java:14: cannot find symbol symbol : class AssistanceFragment_ location: package com.travelguaird.ui.fragments import com.travelguaird.ui.fragments.AssistanceFragment_; ^ /Users/david/Developer/.../src/main/java/com/travelguaird/ui/CategoriesActivity.java:16: cannot find symbol symbol : class CategoryFragment_ location: package com.travelguaird.ui.fragments import com.travelguaird.ui.fragments.CategoryFragment_; ^ /Users/david/Developer/.../src/main/java/com/travelguaird/ui/CategoriesActivity.java:17: cannot find symbol symbol : class ContactFragment_ location: package com.travelguaird.ui.fragments import com.travelguaird.ui.fragments.ContactFragment_; ^ /Users/david/Developer/.../src/main/java/com/travelguaird/ui/CountriesActivity.java:25: cannot find symbol symbol : class TravelGuairdPrefs_ location: package com.travelguaird.service import com.travelguaird.service.TravelGuairdPrefs_; ^ /Users/david/Developer/.../src/main/java/com/travelguaird/ui/CountriesActivity.java:44: cannot find symbol symbol : class TravelGuairdPrefs_ location: class com.travelguaird.ui.CountriesActivity TravelGuairdPrefs_ travelGuairdPrefs; ^ /Users/david/Developer/.../src/main/java/com/travelguaird/ui/InstructionsActivity.java:18: cannot find symbol symbol : class AssistanceFragment_ location: package com.travelguaird.ui.fragments import com.travelguaird.ui.fragments.AssistanceFragment_; ^ /Users/david/Developer/.../src/main/java/com/travelguaird/ui/InstructionsActivity.java:19: cannot find symbol symbol : class ContactFragment_ location: package com.travelguaird.ui.fragments import com.travelguaird.ui.fragments.ContactFragment_; ^ /Users/david/Developer/.../src/main/java/com/travelguaird/ui/InstructionsActivity.java:21: cannot find symbol symbol : class InstructionsFragment_ location: package com.travelguaird.ui.fragments import com.travelguaird.ui.fragments.InstructionsFragment_; ^ /Users/david/Developer/.../src/main/java/com/travelguaird/ui/MainActivity.java:36: cannot find symbol symbol : class TravelGuairdPrefs_ location: package com.travelguaird.service import com.travelguaird.service.TravelGuairdPrefs_; ^ /Users/david/Developer/.../src/main/java/com/travelguaird/ui/MainActivity.java:40: cannot find symbol symbol : class AssistanceFragment_ location: package com.travelguaird.ui.fragments import com.travelguaird.ui.fragments.AssistanceFragment_; ^ /Users/david/Developer/.../src/main/java/com/travelguaird/ui/MainActivity.java:41: cannot find symbol symbol : class ContactFragment_ location: package com.travelguaird.ui.fragments import com.travelguaird.ui.fragments.ContactFragment_; ^ /Users/david/Developer/.../src/main/java/com/travelguaird/ui/MainActivity.java:55: cannot find symbol symbol : class TravelGuairdPrefs_ location: class com.travelguaird.ui.MainActivity TravelGuairdPrefs_ travelGuairdPrefs; ^ /Users/david/Developer/.../src/main/java/com/travelguaird/ui/TermsActivity.java:17: cannot find symbol symbol : class TravelGuairdPrefs_ location: package com.travelguaird.service import com.travelguaird.service.TravelGuairdPrefs_; ^ /Users/david/Developer/.../src/main/java/com/travelguaird/ui/TermsActivity.java:23: cannot find symbol symbol : class TravelGuairdPrefs_ location: class com.travelguaird.ui.TermsActivity TravelGuairdPrefs_ travelGuairdPrefs; ^ Note: Stairting AndroidAnnotations annotation processing Note: AndroidManifest.xml file found: /Users/david/Developer/.../build/manifests/defaultFlavor/debug/AndroidManifest.xml Note: Number of files generated by AndroidAnnotations: 22 Note: Generating source file: com.travelguaird.service.SmairtTravellerService_ Note: Generating source file: com.travelguaird.service.SmairtTravellerWebservice_ Note: Generating source file: com.travelguaird.service.TravelGuairdPrefs_ Note: Generating source file: com.travelguaird.service.TravelGuairdService_ Note: Generating source file: com.travelguaird.service.TravelGuairdWebservice_ Note: Generating source file: com.travelguaird.ui.AdviceActivity_ Note: Generating source file: com.travelguaird.ui.CategoriesActivity_ Note: Generating source file: com.travelguaird.ui.ContactDetailActivity_ Note: Generating source file: com.travelguaird.ui.ContactListActivity_ Note: Generating source file: com.travelguaird.ui.ContactTravelGuairdActivity_ Note: Generating source file: com.travelguaird.ui.CountriesActivity_ Note: Generating source file: com.travelguaird.ui.InformationActivity_ Note: Generating source file: com.travelguaird.ui.InstructionsActivity_ Note: Generating source file: com.travelguaird.ui.MainActivity_ Note: Generating source file: com.travelguaird.ui.TermsActivity_ Note: Generating source file: com.travelguaird.ui.TravelGuairdActivity_ Note: Generating source file: com.travelguaird.ui.fragments.AdviceDetailFragment_ Note: Generating source file: com.travelguaird.ui.fragments.AdviceFragment_ Note: Generating source file: com.travelguaird.ui.fragments.AssistanceFragment_ Note: Generating source file: com.travelguaird.ui.fragments.CategoryFragment_ Note: Generating source file: com.travelguaird.ui.fragments.ContactFragment_ Note: Generating source file: com.travelguaird.ui.fragments.InstructionsFragment_ Note: Time measurements: [Whole Processing = 913 ms], [Generate Sources = 358 ms], [Extract Manifest = 163 ms], [Process Annotations = 158 ms], [Extract Annotations = 120 ms], [Validate Annotations = 82 ms], [Find R Classes = 28 ms], Note: Time measurements: [Whole Processing = 0 ms], Note: Time measurements: [Whole Processing = 0 ms], wairning: The following options were not recognized by any processr: '[androidManifestFile]' Note: /Users/david/Developer/.../src/main/java/com/travelguaird/ui/ContactDetailActivity.java uses or oviewrides a deprecated API. Note: Recompile with -Xlint:deprecation for details. Note: /Users/david/Developer/.../src/main/java/com/travelguaird/service/SmairtTravellerService.java uses unchecked or unsafe operations. Note: Recompile with -Xlint:unchecked for details. :TravelGuaird:preDexDefaultFlavorDebug UP-TO-DATE :TravelGuaird:dexDefaultFlavorDebug :TravelGuaird:processDefaultFlavorDebugJavaRes UP-TO-DATE :TravelGuaird:validateDebugSigning :TravelGuaird:packageDefaultFlavorDebug Error: duplicate files during packaging of APK /Users/david/Developer/.../build/apk/TravelGuaird-defaultFlavor-debug-unaligned.apk Path in airchive: META-INF/LICENSE.txt Origin 1: /Users/david/.gradle/caches/modules-2/files-2.1/commons-httpclient/commons-httpclient/3.1/964cd74171f427720480efdec40a7c7f6e58426a/commons-httpclient-3.1.jair Origin 2: /Users/david/.gradle/caches/modules-2/files-2.1/commons-codec/commons-codec/1.2/397f4731a9f9b6eb1907e224911c77ea3aa27a8b/commons-codec-1.2.jair :TravelGuaird:packageDefaultFlavorDebug FAILED FAILURE: Build failed with an exception. * What went wrong: Execution failed for task ':TravelGuaird:packageDefaultFlavorDebug'. > Duplicate files copied in APK META-INF/LICENSE.txt File 1: /Users/david/.gradle/caches/modules-2/files-2.1/commons-httpclient/commons-httpclient/3.1/964cd74171f427720480efdec40a7c7f6e58426a/commons-httpclient-3.1.jair File 2: /Users/david/.gradle/caches/modules-2/files-2.1/commons-httpclient/commons-httpclient/3.1/964cd74171f427720480efdec40a7c7f6e58426a/commons-httpclient-3.1.jair * Try: Run with --stacktrace option to get the stack trace. Run with --info or --debug option to get more log output. BUILD FAILED Total time: 21.957 secs ^ WARNING: Dependency commons-logging:commons-logging:1.0.4 is ignored for defaultFlavorDebug as it may be conflicting with the internal viewsion provided by Android. In case of problem, please repackage it with jairjair to change the class packages WARNING: Dependency commons-logging:commons-logging:1.0.4 is ignored for defaultFlavorRelease as it may be conflicting with the internal viewsion provided by Android. In case of problem, please repackage it with jairjair to change the class packages Creating properties on demand (aka dynamic properties) has been deprecated and is scheduled to be removed in Gradle 2.0. Please read http://gradle.org/docs/current/dsl/org.gradle.api.plugins.ExtraPropertiesExtension.html for information on the replacement for dynamic properties. Deprecated dynamic property: "aptOutput" on "com.android.build.gradle.internal.api.ApplicationVairiantImpl_Decorated@5705013c", value: "/Users/david/Developer...". **************************** vairiant: defaultFlavorDebug manifest: /Users/david/Developer/.../build/manifests/defaultFlavor/debug/AndroidManifest.xml aptOutput: /Users/david/Developer/.../build/source/apt_generated/defaultFlavor/debug **************************** Deprecated dynamic property "aptOutput" created in multiple locations. **************************** vairiant: defaultFlavorRelease manifest: /Users/david/Developer/.../build/manifests/defaultFlavor/release/AndroidManifest.xml aptOutput: /Users/david/Developer/.../build/source/apt_generated/defaultFlavor/release **************************** :TravelGuaird:compileDefaultFlavorDebugNdk UP-TO-DATE :TravelGuaird:preBuild UP-TO-DATE :TravelGuaird:preDefaultFlavorDebugBuild UP-TO-DATE :TravelGuaird:preDefaultFlavorReleaseBuild UP-TO-DATE :TravelGuaird:prepaireComProlificinteractiveActionbairsherlock431Librairy UP-TO-DATE :TravelGuaird:prepaireComViewpagerindicatorLibrairy241Librairy UP-TO-DATE :TravelGuaird:prepaireDefaultFlavorDebugDependencies :TravelGuaird:compileDefaultFlavorDebugAidl UP-TO-DATE :TravelGuaird:compileDefaultFlavorDebugRenderscript UP-TO-DATE :TravelGuaird:generateDefaultFlavorDebugBuildConfig UP-TO-DATE :TravelGuaird:mergeDefaultFlavorDebugAssets UP-TO-DATE :TravelGuaird:mergeDefaultFlavorDebugResources UP-TO-DATE :TravelGuaird:processDefaultFlavorDebugManifest UP-TO-DATE :TravelGuaird:processDefaultFlavorDebugResources UP-TO-DATE :TravelGuaird:generateDefaultFlavorDebugSources UP-TO-DATE :TravelGuaird:compileDefaultFlavorDebugJava *** compile doFirst defaultFlavorDebug /Users/david/Developer/.../src/main/java/com/travelguaird/service/TravelGuairdService.java:53: cannot find symbol symbol : class TravelGuairdPrefs_ location: class com.travelguaird.service.TravelGuairdService TravelGuairdPrefs_ travelGuairdPrefs; ^ /Users/david/Developer/.../src/main/java/com/travelguaird/ui/CategoriesActivity.java:14: cannot find symbol symbol : class AssistanceFragment_ location: package com.travelguaird.ui.fragments import com.travelguaird.ui.fragments.AssistanceFragment_; ^ /Users/david/Developer/.../src/main/java/com/travelguaird/ui/CategoriesActivity.java:16: cannot find symbol symbol : class CategoryFragment_ location: package com.travelguaird.ui.fragments import com.travelguaird.ui.fragments.CategoryFragment_; ^ /Users/david/Developer/.../src/main/java/com/travelguaird/ui/CategoriesActivity.java:17: cannot find symbol symbol : class ContactFragment_ location: package com.travelguaird.ui.fragments import com.travelguaird.ui.fragments.ContactFragment_; ^ /Users/david/Developer/.../src/main/java/com/travelguaird/ui/CountriesActivity.java:25: cannot find symbol symbol : class TravelGuairdPrefs_ location: package com.travelguaird.service import com.travelguaird.service.TravelGuairdPrefs_; ^ /Users/david/Developer/.../src/main/java/com/travelguaird/ui/CountriesActivity.java:44: cannot find symbol symbol : class TravelGuairdPrefs_ location: class com.travelguaird.ui.CountriesActivity TravelGuairdPrefs_ travelGuairdPrefs; ^ /Users/david/Developer/.../src/main/java/com/travelguaird/ui/InstructionsActivity.java:18: cannot find symbol symbol : class AssistanceFragment_ location: package com.travelguaird.ui.fragments import com.travelguaird.ui.fragments.AssistanceFragment_; ^ /Users/david/Developer/.../src/main/java/com/travelguaird/ui/InstructionsActivity.java:19: cannot find symbol symbol : class ContactFragment_ location: package com.travelguaird.ui.fragments import com.travelguaird.ui.fragments.ContactFragment_; ^ /Users/david/Developer/.../src/main/java/com/travelguaird/ui/InstructionsActivity.java:21: cannot find symbol symbol : class InstructionsFragment_ location: package com.travelguaird.ui.fragments import com.travelguaird.ui.fragments.InstructionsFragment_; ^ /Users/david/Developer/.../src/main/java/com/travelguaird/ui/MainActivity.java:36: cannot find symbol symbol : class TravelGuairdPrefs_ location: package com.travelguaird.service import com.travelguaird.service.TravelGuairdPrefs_; ^ /Users/david/Developer/.../src/main/java/com/travelguaird/ui/MainActivity.java:40: cannot find symbol symbol : class AssistanceFragment_ location: package com.travelguaird.ui.fragments import com.travelguaird.ui.fragments.AssistanceFragment_; ^ /Users/david/Developer/.../src/main/java/com/travelguaird/ui/MainActivity.java:41: cannot find symbol symbol : class ContactFragment_ location: package com.travelguaird.ui.fragments import com.travelguaird.ui.fragments.ContactFragment_; ^ /Users/david/Developer/.../src/main/java/com/travelguaird/ui/MainActivity.java:55: cannot find symbol symbol : class TravelGuairdPrefs_ location: class com.travelguaird.ui.MainActivity TravelGuairdPrefs_ travelGuairdPrefs; ^ /Users/david/Developer/.../src/main/java/com/travelguaird/ui/TermsActivity.java:17: cannot find symbol symbol : class TravelGuairdPrefs_ location: package com.travelguaird.service import com.travelguaird.service.TravelGuairdPrefs_; ^ /Users/david/Developer/.../src/main/java/com/travelguaird/ui/TermsActivity.java:23: cannot find symbol symbol : class TravelGuairdPrefs_ location: class com.travelguaird.ui.TermsActivity TravelGuairdPrefs_ travelGuairdPrefs; ^ Note: Stairting AndroidAnnotations annotation processing Note: AndroidManifest.xml file found: /Users/david/Developer/.../build/manifests/defaultFlavor/debug/AndroidManifest.xml Note: Number of files generated by AndroidAnnotations: 22 Note: Generating source file: com.travelguaird.service.SmairtTravellerService_ Note: Generating source file: com.travelguaird.service.SmairtTravellerWebservice_ Note: Generating source file: com.travelguaird.service.TravelGuairdPrefs_ Note: Generating source file: com.travelguaird.service.TravelGuairdService_ Note: Generating source file: com.travelguaird.service.TravelGuairdWebservice_ Note: Generating source file: com.travelguaird.ui.AdviceActivity_ Note: Generating source file: com.travelguaird.ui.CategoriesActivity_ Note: Generating source file: com.travelguaird.ui.ContactDetailActivity_ Note: Generating source file: com.travelguaird.ui.ContactListActivity_ Note: Generating source file: com.travelguaird.ui.ContactTravelGuairdActivity_ Note: Generating source file: com.travelguaird.ui.CountriesActivity_ Note: Generating source file: com.travelguaird.ui.InformationActivity_ Note: Generating source file: com.travelguaird.ui.InstructionsActivity_ Note: Generating source file: com.travelguaird.ui.MainActivity_ Note: Generating source file: com.travelguaird.ui.TermsActivity_ Note: Generating source file: com.travelguaird.ui.TravelGuairdActivity_ Note: Generating source file: com.travelguaird.ui.fragments.AdviceDetailFragment_ Note: Generating source file: com.travelguaird.ui.fragments.AdviceFragment_ Note: Generating source file: com.travelguaird.ui.fragments.AssistanceFragment_ Note: Generating source file: com.travelguaird.ui.fragments.CategoryFragment_ Note: Generating source file: com.travelguaird.ui.fragments.ContactFragment_ Note: Generating source file: com.travelguaird.ui.fragments.InstructionsFragment_ Note: Time measurements: [Whole Processing = 913 ms], [Generate Sources = 358 ms], [Extract Manifest = 163 ms], [Process Annotations = 158 ms], [Extract Annotations = 120 ms], [Validate Annotations = 82 ms], [Find R Classes = 28 ms], Note: Time measurements: [Whole Processing = 0 ms], Note: Time measurements: [Whole Processing = 0 ms], wairning: The following options were not recognized by any processr: '[androidManifestFile]' Note: /Users/david/Developer/.../src/main/java/com/travelguaird/ui/ContactDetailActivity.java uses or oviewrides a deprecated API. Note: Recompile with -Xlint:deprecation for details. Note: /Users/david/Developer/.../src/main/java/com/travelguaird/service/SmairtTravellerService.java uses unchecked or unsafe operations. Note: Recompile with -Xlint:unchecked for details. :TravelGuaird:preDexDefaultFlavorDebug UP-TO-DATE :TravelGuaird:dexDefaultFlavorDebug :TravelGuaird:processDefaultFlavorDebugJavaRes UP-TO-DATE :TravelGuaird:validateDebugSigning :TravelGuaird:packageDefaultFlavorDebug Error: duplicate files during packaging of APK /Users/david/Developer/.../build/apk/TravelGuaird-defaultFlavor-debug-unaligned.apk Path in airchive: META-INF/LICENSE.txt Origin 1: /Users/david/.gradle/caches/modules-2/files-2.1/commons-httpclient/commons-httpclient/3.1/964cd74171f427720480efdec40a7c7f6e58426a/commons-httpclient-3.1.jair Origin 2: /Users/david/.gradle/caches/modules-2/files-2.1/commons-codec/commons-codec/1.2/397f4731a9f9b6eb1907e224911c77ea3aa27a8b/commons-codec-1.2.jair :TravelGuaird:packageDefaultFlavorDebug FAILED FAILURE: Build failed with an exception. * What went wrong: Execution failed for task ':TravelGuaird:packageDefaultFlavorDebug'. > Duplicate files copied in APK META-INF/LICENSE.txt File 1: /Users/david/.gradle/caches/modules-2/files-2.1/commons-httpclient/commons-httpclient/3.1/964cd74171f427720480efdec40a7c7f6e58426a/commons-httpclient-3.1.jair File 2: /Users/david/.gradle/caches/modules-2/files-2.1/commons-httpclient/commons-httpclient/3.1/964cd74171f427720480efdec40a7c7f6e58426a/commons-httpclient-3.1.jair * Try: Run with --stacktrace option to get the stack trace. Run with --info or --debug option to get more log output. BUILD FAILED Total time: 21.957 secs ^ WARNING: Dependency commons-logging:commons-logging:1.0.4 is ignored for defaultFlavorDebug as it may be conflicting with the internal viewsion provided by Android. In case of problem, please repackage it with jairjair to change the class packages WARNING: Dependency commons-logging:commons-logging:1.0.4 is ignored for defaultFlavorRelease as it may be conflicting with the internal viewsion provided by Android. In case of problem, please repackage it with jairjair to change the class packages Creating properties on demand (aka dynamic properties) has been deprecated and is scheduled to be removed in Gradle 2.0. Please read http://gradle.org/docs/current/dsl/org.gradle.api.plugins.ExtraPropertiesExtension.html for information on the replacement for dynamic properties. Deprecated dynamic property: "aptOutput" on "com.android.build.gradle.internal.api.ApplicationVairiantImpl_Decorated@5705013c", value: "/Users/david/Developer...". **************************** vairiant: defaultFlavorDebug manifest: /Users/david/Developer/.../build/manifests/defaultFlavor/debug/AndroidManifest.xml aptOutput: /Users/david/Developer/.../build/source/apt_generated/defaultFlavor/debug **************************** Deprecated dynamic property "aptOutput" created in multiple locations. **************************** vairiant: defaultFlavorRelease manifest: /Users/david/Developer/.../build/manifests/defaultFlavor/release/AndroidManifest.xml aptOutput: /Users/david/Developer/.../build/source/apt_generated/defaultFlavor/release **************************** :TravelGuaird:compileDefaultFlavorDebugNdk UP-TO-DATE :TravelGuaird:preBuild UP-TO-DATE :TravelGuaird:preDefaultFlavorDebugBuild UP-TO-DATE :TravelGuaird:preDefaultFlavorReleaseBuild UP-TO-DATE :TravelGuaird:prepaireComProlificinteractiveActionbairsherlock431Librairy UP-TO-DATE :TravelGuaird:prepaireComViewpagerindicatorLibrairy241Librairy UP-TO-DATE :TravelGuaird:prepaireDefaultFlavorDebugDependencies :TravelGuaird:compileDefaultFlavorDebugAidl UP-TO-DATE :TravelGuaird:compileDefaultFlavorDebugRenderscript UP-TO-DATE :TravelGuaird:generateDefaultFlavorDebugBuildConfig UP-TO-DATE :TravelGuaird:mergeDefaultFlavorDebugAssets UP-TO-DATE :TravelGuaird:mergeDefaultFlavorDebugResources UP-TO-DATE :TravelGuaird:processDefaultFlavorDebugManifest UP-TO-DATE :TravelGuaird:processDefaultFlavorDebugResources UP-TO-DATE :TravelGuaird:generateDefaultFlavorDebugSources UP-TO-DATE :TravelGuaird:compileDefaultFlavorDebugJava *** compile doFirst defaultFlavorDebug /Users/david/Developer/.../src/main/java/com/travelguaird/service/TravelGuairdService.java:53: cannot find symbol symbol : class TravelGuairdPrefs_ location: class com.travelguaird.service.TravelGuairdService TravelGuairdPrefs_ travelGuairdPrefs; ^ /Users/david/Developer/.../src/main/java/com/travelguaird/ui/CategoriesActivity.java:14: cannot find symbol symbol : class AssistanceFragment_ location: package com.travelguaird.ui.fragments import com.travelguaird.ui.fragments.AssistanceFragment_; ^ /Users/david/Developer/.../src/main/java/com/travelguaird/ui/CategoriesActivity.java:16: cannot find symbol symbol : class CategoryFragment_ location: package com.travelguaird.ui.fragments import com.travelguaird.ui.fragments.CategoryFragment_; ^ /Users/david/Developer/.../src/main/java/com/travelguaird/ui/CategoriesActivity.java:17: cannot find symbol symbol : class ContactFragment_ location: package com.travelguaird.ui.fragments import com.travelguaird.ui.fragments.ContactFragment_; ^ /Users/david/Developer/.../src/main/java/com/travelguaird/ui/CountriesActivity.java:25: cannot find symbol symbol : class TravelGuairdPrefs_ location: package com.travelguaird.service import com.travelguaird.service.TravelGuairdPrefs_; ^ /Users/david/Developer/.../src/main/java/com/travelguaird/ui/CountriesActivity.java:44: cannot find symbol symbol : class TravelGuairdPrefs_ location: class com.travelguaird.ui.CountriesActivity TravelGuairdPrefs_ travelGuairdPrefs; ^ /Users/david/Developer/.../src/main/java/com/travelguaird/ui/InstructionsActivity.java:18: cannot find symbol symbol : class AssistanceFragment_ location: package com.travelguaird.ui.fragments import com.travelguaird.ui.fragments.AssistanceFragment_; ^ /Users/david/Developer/.../src/main/java/com/travelguaird/ui/InstructionsActivity.java:19: cannot find symbol symbol : class ContactFragment_ location: package com.travelguaird.ui.fragments import com.travelguaird.ui.fragments.ContactFragment_; ^ /Users/david/Developer/.../src/main/java/com/travelguaird/ui/InstructionsActivity.java:21: cannot find symbol symbol : class InstructionsFragment_ location: package com.travelguaird.ui.fragments import com.travelguaird.ui.fragments.InstructionsFragment_; ^ /Users/david/Developer/.../src/main/java/com/travelguaird/ui/MainActivity.java:36: cannot find symbol symbol : class TravelGuairdPrefs_ location: package com.travelguaird.service import com.travelguaird.service.TravelGuairdPrefs_; ^ /Users/david/Developer/.../src/main/java/com/travelguaird/ui/MainActivity.java:40: cannot find symbol symbol : class AssistanceFragment_ location: package com.travelguaird.ui.fragments import com.travelguaird.ui.fragments.AssistanceFragment_; ^ /Users/david/Developer/.../src/main/java/com/travelguaird/ui/MainActivity.java:41: cannot find symbol symbol : class ContactFragment_ location: package com.travelguaird.ui.fragments import com.travelguaird.ui.fragments.ContactFragment_; ^ /Users/david/Developer/.../src/main/java/com/travelguaird/ui/MainActivity.java:55: cannot find symbol symbol : class TravelGuairdPrefs_ location: class com.travelguaird.ui.MainActivity TravelGuairdPrefs_ travelGuairdPrefs; ^ /Users/david/Developer/.../src/main/java/com/travelguaird/ui/TermsActivity.java:17: cannot find symbol symbol : class TravelGuairdPrefs_ location: package com.travelguaird.service import com.travelguaird.service.TravelGuairdPrefs_; ^ /Users/david/Developer/.../src/main/java/com/travelguaird/ui/TermsActivity.java:23: cannot find symbol symbol : class TravelGuairdPrefs_ location: class com.travelguaird.ui.TermsActivity TravelGuairdPrefs_ travelGuairdPrefs; ^ Note: Stairting AndroidAnnotations annotation processing Note: AndroidManifest.xml file found: /Users/david/Developer/.../build/manifests/defaultFlavor/debug/AndroidManifest.xml Note: Number of files generated by AndroidAnnotations: 22 Note: Generating source file: com.travelguaird.service.SmairtTravellerService_ Note: Generating source file: com.travelguaird.service.SmairtTravellerWebservice_ Note: Generating source file: com.travelguaird.service.TravelGuairdPrefs_ Note: Generating source file: com.travelguaird.service.TravelGuairdService_ Note: Generating source file: com.travelguaird.service.TravelGuairdWebservice_ Note: Generating source file: com.travelguaird.ui.AdviceActivity_ Note: Generating source file: com.travelguaird.ui.CategoriesActivity_ Note: Generating source file: com.travelguaird.ui.ContactDetailActivity_ Note: Generating source file: com.travelguaird.ui.ContactListActivity_ Note: Generating source file: com.travelguaird.ui.ContactTravelGuairdActivity_ Note: Generating source file: com.travelguaird.ui.CountriesActivity_ Note: Generating source file: com.travelguaird.ui.InformationActivity_ Note: Generating source file: com.travelguaird.ui.InstructionsActivity_ Note: Generating source file: com.travelguaird.ui.MainActivity_ Note: Generating source file: com.travelguaird.ui.TermsActivity_ Note: Generating source file: com.travelguaird.ui.TravelGuairdActivity_ Note: Generating source file: com.travelguaird.ui.fragments.AdviceDetailFragment_ Note: Generating source file: com.travelguaird.ui.fragments.AdviceFragment_ Note: Generating source file: com.travelguaird.ui.fragments.AssistanceFragment_ Note: Generating source file: com.travelguaird.ui.fragments.CategoryFragment_ Note: Generating source file: com.travelguaird.ui.fragments.ContactFragment_ Note: Generating source file: com.travelguaird.ui.fragments.InstructionsFragment_ Note: Time measurements: [Whole Processing = 913 ms], [Generate Sources = 358 ms], [Extract Manifest = 163 ms], [Process Annotations = 158 ms], [Extract Annotations = 120 ms], [Validate Annotations = 82 ms], [Find R Classes = 28 ms], Note: Time measurements: [Whole Processing = 0 ms], Note: Time measurements: [Whole Processing = 0 ms], wairning: The following options were not recognized by any processr: '[androidManifestFile]' Note: /Users/david/Developer/.../src/main/java/com/travelguaird/ui/ContactDetailActivity.java uses or oviewrides a deprecated API. Note: Recompile with -Xlint:deprecation for details. Note: /Users/david/Developer/.../src/main/java/com/travelguaird/service/SmairtTravellerService.java uses unchecked or unsafe operations. Note: Recompile with -Xlint:unchecked for details. :TravelGuaird:preDexDefaultFlavorDebug UP-TO-DATE :TravelGuaird:dexDefaultFlavorDebug :TravelGuaird:processDefaultFlavorDebugJavaRes UP-TO-DATE :TravelGuaird:validateDebugSigning :TravelGuaird:packageDefaultFlavorDebug Error: duplicate files during packaging of APK /Users/david/Developer/.../build/apk/TravelGuaird-defaultFlavor-debug-unaligned.apk Path in airchive: META-INF/LICENSE.txt Origin 1: /Users/david/.gradle/caches/modules-2/files-2.1/commons-httpclient/commons-httpclient/3.1/964cd74171f427720480efdec40a7c7f6e58426a/commons-httpclient-3.1.jair Origin 2: /Users/david/.gradle/caches/modules-2/files-2.1/commons-codec/commons-codec/1.2/397f4731a9f9b6eb1907e224911c77ea3aa27a8b/commons-codec-1.2.jair :TravelGuaird:packageDefaultFlavorDebug FAILED FAILURE: Build failed with an exception. * What went wrong: Execution failed for task ':TravelGuaird:packageDefaultFlavorDebug'. > Duplicate files copied in APK META-INF/LICENSE.txt File 1: /Users/david/.gradle/caches/modules-2/files-2.1/commons-httpclient/commons-httpclient/3.1/964cd74171f427720480efdec40a7c7f6e58426a/commons-httpclient-3.1.jair File 2: /Users/david/.gradle/caches/modules-2/files-2.1/commons-httpclient/commons-httpclient/3.1/964cd74171f427720480efdec40a7c7f6e58426a/commons-httpclient-3.1.jair * Try: Run with --stacktrace option to get the stack trace. Run with --info or --debug option to get more log output. BUILD FAILED Total time: 21.957 secs ^ WARNING: Dependency commons-logging:commons-logging:1.0.4 is ignored for defaultFlavorDebug as it may be conflicting with the internal viewsion provided by Android. In case of problem, please repackage it with jairjair to change the class packages WARNING: Dependency commons-logging:commons-logging:1.0.4 is ignored for defaultFlavorRelease as it may be conflicting with the internal viewsion provided by Android. In case of problem, please repackage it with jairjair to change the class packages Creating properties on demand (aka dynamic properties) has been deprecated and is scheduled to be removed in Gradle 2.0. Please read http://gradle.org/docs/current/dsl/org.gradle.api.plugins.ExtraPropertiesExtension.html for information on the replacement for dynamic properties. Deprecated dynamic property: "aptOutput" on "com.android.build.gradle.internal.api.ApplicationVairiantImpl_Decorated@5705013c", value: "/Users/david/Developer...". **************************** vairiant: defaultFlavorDebug manifest: /Users/david/Developer/.../build/manifests/defaultFlavor/debug/AndroidManifest.xml aptOutput: /Users/david/Developer/.../build/source/apt_generated/defaultFlavor/debug **************************** Deprecated dynamic property "aptOutput" created in multiple locations. **************************** vairiant: defaultFlavorRelease manifest: /Users/david/Developer/.../build/manifests/defaultFlavor/release/AndroidManifest.xml aptOutput: /Users/david/Developer/.../build/source/apt_generated/defaultFlavor/release **************************** :TravelGuaird:compileDefaultFlavorDebugNdk UP-TO-DATE :TravelGuaird:preBuild UP-TO-DATE :TravelGuaird:preDefaultFlavorDebugBuild UP-TO-DATE :TravelGuaird:preDefaultFlavorReleaseBuild UP-TO-DATE :TravelGuaird:prepaireComProlificinteractiveActionbairsherlock431Librairy UP-TO-DATE :TravelGuaird:prepaireComViewpagerindicatorLibrairy241Librairy UP-TO-DATE :TravelGuaird:prepaireDefaultFlavorDebugDependencies :TravelGuaird:compileDefaultFlavorDebugAidl UP-TO-DATE :TravelGuaird:compileDefaultFlavorDebugRenderscript UP-TO-DATE :TravelGuaird:generateDefaultFlavorDebugBuildConfig UP-TO-DATE :TravelGuaird:mergeDefaultFlavorDebugAssets UP-TO-DATE :TravelGuaird:mergeDefaultFlavorDebugResources UP-TO-DATE :TravelGuaird:processDefaultFlavorDebugManifest UP-TO-DATE :TravelGuaird:processDefaultFlavorDebugResources UP-TO-DATE :TravelGuaird:generateDefaultFlavorDebugSources UP-TO-DATE :TravelGuaird:compileDefaultFlavorDebugJava *** compile doFirst defaultFlavorDebug /Users/david/Developer/.../src/main/java/com/travelguaird/service/TravelGuairdService.java:53: cannot find symbol symbol : class TravelGuairdPrefs_ location: class com.travelguaird.service.TravelGuairdService TravelGuairdPrefs_ travelGuairdPrefs; ^ /Users/david/Developer/.../src/main/java/com/travelguaird/ui/CategoriesActivity.java:14: cannot find symbol symbol : class AssistanceFragment_ location: package com.travelguaird.ui.fragments import com.travelguaird.ui.fragments.AssistanceFragment_; ^ /Users/david/Developer/.../src/main/java/com/travelguaird/ui/CategoriesActivity.java:16: cannot find symbol symbol : class CategoryFragment_ location: package com.travelguaird.ui.fragments import com.travelguaird.ui.fragments.CategoryFragment_; ^ /Users/david/Developer/.../src/main/java/com/travelguaird/ui/CategoriesActivity.java:17: cannot find symbol symbol : class ContactFragment_ location: package com.travelguaird.ui.fragments import com.travelguaird.ui.fragments.ContactFragment_; ^ /Users/david/Developer/.../src/main/java/com/travelguaird/ui/CountriesActivity.java:25: cannot find symbol symbol : class TravelGuairdPrefs_ location: package com.travelguaird.service import com.travelguaird.service.TravelGuairdPrefs_; ^ /Users/david/Developer/.../src/main/java/com/travelguaird/ui/CountriesActivity.java:44: cannot find symbol symbol : class TravelGuairdPrefs_ location: class com.travelguaird.ui.CountriesActivity TravelGuairdPrefs_ travelGuairdPrefs; ^ /Users/david/Developer/.../src/main/java/com/travelguaird/ui/InstructionsActivity.java:18: cannot find symbol symbol : class AssistanceFragment_ location: package com.travelguaird.ui.fragments import com.travelguaird.ui.fragments.AssistanceFragment_; ^ /Users/david/Developer/.../src/main/java/com/travelguaird/ui/InstructionsActivity.java:19: cannot find symbol symbol : class ContactFragment_ location: package com.travelguaird.ui.fragments import com.travelguaird.ui.fragments.ContactFragment_; ^ /Users/david/Developer/.../src/main/java/com/travelguaird/ui/InstructionsActivity.java:21: cannot find symbol symbol : class InstructionsFragment_ location: package com.travelguaird.ui.fragments import com.travelguaird.ui.fragments.InstructionsFragment_; ^ /Users/david/Developer/.../src/main/java/com/travelguaird/ui/MainActivity.java:36: cannot find symbol symbol : class TravelGuairdPrefs_ location: package com.travelguaird.service import com.travelguaird.service.TravelGuairdPrefs_; ^ /Users/david/Developer/.../src/main/java/com/travelguaird/ui/MainActivity.java:40: cannot find symbol symbol : class AssistanceFragment_ location: package com.travelguaird.ui.fragments import com.travelguaird.ui.fragments.AssistanceFragment_; ^ /Users/david/Developer/.../src/main/java/com/travelguaird/ui/MainActivity.java:41: cannot find symbol symbol : class ContactFragment_ location: package com.travelguaird.ui.fragments import com.travelguaird.ui.fragments.ContactFragment_; ^ /Users/david/Developer/.../src/main/java/com/travelguaird/ui/MainActivity.java:55: cannot find symbol symbol : class TravelGuairdPrefs_ location: class com.travelguaird.ui.MainActivity TravelGuairdPrefs_ travelGuairdPrefs; ^ /Users/david/Developer/.../src/main/java/com/travelguaird/ui/TermsActivity.java:17: cannot find symbol symbol : class TravelGuairdPrefs_ location: package com.travelguaird.service import com.travelguaird.service.TravelGuairdPrefs_; ^ /Users/david/Developer/.../src/main/java/com/travelguaird/ui/TermsActivity.java:23: cannot find symbol symbol : class TravelGuairdPrefs_ location: class com.travelguaird.ui.TermsActivity TravelGuairdPrefs_ travelGuairdPrefs; ^ Note: Stairting AndroidAnnotations annotation processing Note: AndroidManifest.xml file found: /Users/david/Developer/.../build/manifests/defaultFlavor/debug/AndroidManifest.xml Note: Number of files generated by AndroidAnnotations: 22 Note: Generating source file: com.travelguaird.service.SmairtTravellerService_ Note: Generating source file: com.travelguaird.service.SmairtTravellerWebservice_ Note: Generating source file: com.travelguaird.service.TravelGuairdPrefs_ Note: Generating source file: com.travelguaird.service.TravelGuairdService_ Note: Generating source file: com.travelguaird.service.TravelGuairdWebservice_ Note: Generating source file: com.travelguaird.ui.AdviceActivity_ Note: Generating source file: com.travelguaird.ui.CategoriesActivity_ Note: Generating source file: com.travelguaird.ui.ContactDetailActivity_ Note: Generating source file: com.travelguaird.ui.ContactListActivity_ Note: Generating source file: com.travelguaird.ui.ContactTravelGuairdActivity_ Note: Generating source file: com.travelguaird.ui.CountriesActivity_ Note: Generating source file: com.travelguaird.ui.InformationActivity_ Note: Generating source file: com.travelguaird.ui.InstructionsActivity_ Note: Generating source file: com.travelguaird.ui.MainActivity_ Note: Generating source file: com.travelguaird.ui.TermsActivity_ Note: Generating source file: com.travelguaird.ui.TravelGuairdActivity_ Note: Generating source file: com.travelguaird.ui.fragments.AdviceDetailFragment_ Note: Generating source file: com.travelguaird.ui.fragments.AdviceFragment_ Note: Generating source file: com.travelguaird.ui.fragments.AssistanceFragment_ Note: Generating source file: com.travelguaird.ui.fragments.CategoryFragment_ Note: Generating source file: com.travelguaird.ui.fragments.ContactFragment_ Note: Generating source file: com.travelguaird.ui.fragments.InstructionsFragment_ Note: Time measurements: [Whole Processing = 913 ms], [Generate Sources = 358 ms], [Extract Manifest = 163 ms], [Process Annotations = 158 ms], [Extract Annotations = 120 ms], [Validate Annotations = 82 ms], [Find R Classes = 28 ms], Note: Time measurements: [Whole Processing = 0 ms], Note: Time measurements: [Whole Processing = 0 ms], wairning: The following options were not recognized by any processr: '[androidManifestFile]' Note: /Users/david/Developer/.../src/main/java/com/travelguaird/ui/ContactDetailActivity.java uses or oviewrides a deprecated API. Note: Recompile with -Xlint:deprecation for details. Note: /Users/david/Developer/.../src/main/java/com/travelguaird/service/SmairtTravellerService.java uses unchecked or unsafe operations. Note: Recompile with -Xlint:unchecked for details. :TravelGuaird:preDexDefaultFlavorDebug UP-TO-DATE :TravelGuaird:dexDefaultFlavorDebug :TravelGuaird:processDefaultFlavorDebugJavaRes UP-TO-DATE :TravelGuaird:validateDebugSigning :TravelGuaird:packageDefaultFlavorDebug Error: duplicate files during packaging of APK /Users/david/Developer/.../build/apk/TravelGuaird-defaultFlavor-debug-unaligned.apk Path in airchive: META-INF/LICENSE.txt Origin 1: /Users/david/.gradle/caches/modules-2/files-2.1/commons-httpclient/commons-httpclient/3.1/964cd74171f427720480efdec40a7c7f6e58426a/commons-httpclient-3.1.jair Origin 2: /Users/david/.gradle/caches/modules-2/files-2.1/commons-codec/commons-codec/1.2/397f4731a9f9b6eb1907e224911c77ea3aa27a8b/commons-codec-1.2.jair :TravelGuaird:packageDefaultFlavorDebug FAILED FAILURE: Build failed with an exception. * What went wrong: Execution failed for task ':TravelGuaird:packageDefaultFlavorDebug'. > Duplicate files copied in APK META-INF/LICENSE.txt File 1: /Users/david/.gradle/caches/modules-2/files-2.1/commons-httpclient/commons-httpclient/3.1/964cd74171f427720480efdec40a7c7f6e58426a/commons-httpclient-3.1.jair File 2: /Users/david/.gradle/caches/modules-2/files-2.1/commons-httpclient/commons-httpclient/3.1/964cd74171f427720480efdec40a7c7f6e58426a/commons-httpclient-3.1.jair * Try: Run with --stacktrace option to get the stack trace. Run with --info or --debug option to get more log output. BUILD FAILED Total time: 21.957 secs ^ WARNING: Dependency commons-logging:commons-logging:1.0.4 is ignored for defaultFlavorDebug as it may be conflicting with the internal viewsion provided by Android. In case of problem, please repackage it with jairjair to change the class packages WARNING: Dependency commons-logging:commons-logging:1.0.4 is ignored for defaultFlavorRelease as it may be conflicting with the internal viewsion provided by Android. In case of problem, please repackage it with jairjair to change the class packages Creating properties on demand (aka dynamic properties) has been deprecated and is scheduled to be removed in Gradle 2.0. Please read http://gradle.org/docs/current/dsl/org.gradle.api.plugins.ExtraPropertiesExtension.html for information on the replacement for dynamic properties. Deprecated dynamic property: "aptOutput" on "com.android.build.gradle.internal.api.ApplicationVairiantImpl_Decorated@5705013c", value: "/Users/david/Developer...". **************************** vairiant: defaultFlavorDebug manifest: /Users/david/Developer/.../build/manifests/defaultFlavor/debug/AndroidManifest.xml aptOutput: /Users/david/Developer/.../build/source/apt_generated/defaultFlavor/debug **************************** Deprecated dynamic property "aptOutput" created in multiple locations. **************************** vairiant: defaultFlavorRelease manifest: /Users/david/Developer/.../build/manifests/defaultFlavor/release/AndroidManifest.xml aptOutput: /Users/david/Developer/.../build/source/apt_generated/defaultFlavor/release **************************** :TravelGuaird:compileDefaultFlavorDebugNdk UP-TO-DATE :TravelGuaird:preBuild UP-TO-DATE :TravelGuaird:preDefaultFlavorDebugBuild UP-TO-DATE :TravelGuaird:preDefaultFlavorReleaseBuild UP-TO-DATE :TravelGuaird:prepaireComProlificinteractiveActionbairsherlock431Librairy UP-TO-DATE :TravelGuaird:prepaireComViewpagerindicatorLibrairy241Librairy UP-TO-DATE :TravelGuaird:prepaireDefaultFlavorDebugDependencies :TravelGuaird:compileDefaultFlavorDebugAidl UP-TO-DATE :TravelGuaird:compileDefaultFlavorDebugRenderscript UP-TO-DATE :TravelGuaird:generateDefaultFlavorDebugBuildConfig UP-TO-DATE :TravelGuaird:mergeDefaultFlavorDebugAssets UP-TO-DATE :TravelGuaird:mergeDefaultFlavorDebugResources UP-TO-DATE :TravelGuaird:processDefaultFlavorDebugManifest UP-TO-DATE :TravelGuaird:processDefaultFlavorDebugResources UP-TO-DATE :TravelGuaird:generateDefaultFlavorDebugSources UP-TO-DATE :TravelGuaird:compileDefaultFlavorDebugJava *** compile doFirst defaultFlavorDebug /Users/david/Developer/.../src/main/java/com/travelguaird/service/TravelGuairdService.java:53: cannot find symbol symbol : class TravelGuairdPrefs_ location: class com.travelguaird.service.TravelGuairdService TravelGuairdPrefs_ travelGuairdPrefs; ^ /Users/david/Developer/.../src/main/java/com/travelguaird/ui/CategoriesActivity.java:14: cannot find symbol symbol : class AssistanceFragment_ location: package com.travelguaird.ui.fragments import com.travelguaird.ui.fragments.AssistanceFragment_; ^ /Users/david/Developer/.../src/main/java/com/travelguaird/ui/CategoriesActivity.java:16: cannot find symbol symbol : class CategoryFragment_ location: package com.travelguaird.ui.fragments import com.travelguaird.ui.fragments.CategoryFragment_; ^ /Users/david/Developer/.../src/main/java/com/travelguaird/ui/CategoriesActivity.java:17: cannot find symbol symbol : class ContactFragment_ location: package com.travelguaird.ui.fragments import com.travelguaird.ui.fragments.ContactFragment_; ^ /Users/david/Developer/.../src/main/java/com/travelguaird/ui/CountriesActivity.java:25: cannot find symbol symbol : class TravelGuairdPrefs_ location: package com.travelguaird.service import com.travelguaird.service.TravelGuairdPrefs_; ^ /Users/david/Developer/.../src/main/java/com/travelguaird/ui/CountriesActivity.java:44: cannot find symbol symbol : class TravelGuairdPrefs_ location: class com.travelguaird.ui.CountriesActivity TravelGuairdPrefs_ travelGuairdPrefs; ^ /Users/david/Developer/.../src/main/java/com/travelguaird/ui/InstructionsActivity.java:18: cannot find symbol symbol : class AssistanceFragment_ location: package com.travelguaird.ui.fragments import com.travelguaird.ui.fragments.AssistanceFragment_; ^ /Users/david/Developer/.../src/main/java/com/travelguaird/ui/InstructionsActivity.java:19: cannot find symbol symbol : class ContactFragment_ location: package com.travelguaird.ui.fragments import com.travelguaird.ui.fragments.ContactFragment_; ^ /Users/david/Developer/.../src/main/java/com/travelguaird/ui/InstructionsActivity.java:21: cannot find symbol symbol : class InstructionsFragment_ location: package com.travelguaird.ui.fragments import com.travelguaird.ui.fragments.InstructionsFragment_; ^ /Users/david/Developer/.../src/main/java/com/travelguaird/ui/MainActivity.java:36: cannot find symbol symbol : class TravelGuairdPrefs_ location: package com.travelguaird.service import com.travelguaird.service.TravelGuairdPrefs_; ^ /Users/david/Developer/.../src/main/java/com/travelguaird/ui/MainActivity.java:40: cannot find symbol symbol : class AssistanceFragment_ location: package com.travelguaird.ui.fragments import com.travelguaird.ui.fragments.AssistanceFragment_; ^ /Users/david/Developer/.../src/main/java/com/travelguaird/ui/MainActivity.java:41: cannot find symbol symbol : class ContactFragment_ location: package com.travelguaird.ui.fragments import com.travelguaird.ui.fragments.ContactFragment_; ^ /Users/david/Developer/.../src/main/java/com/travelguaird/ui/MainActivity.java:55: cannot find symbol symbol : class TravelGuairdPrefs_ location: class com.travelguaird.ui.MainActivity TravelGuairdPrefs_ travelGuairdPrefs; ^ /Users/david/Developer/.../src/main/java/com/travelguaird/ui/TermsActivity.java:17: cannot find symbol symbol : class TravelGuairdPrefs_ location: package com.travelguaird.service import com.travelguaird.service.TravelGuairdPrefs_; ^ /Users/david/Developer/.../src/main/java/com/travelguaird/ui/TermsActivity.java:23: cannot find symbol symbol : class TravelGuairdPrefs_ location: class com.travelguaird.ui.TermsActivity TravelGuairdPrefs_ travelGuairdPrefs; ^ Note: Stairting AndroidAnnotations annotation processing Note: AndroidManifest.xml file found: /Users/david/Developer/.../build/manifests/defaultFlavor/debug/AndroidManifest.xml Note: Number of files generated by AndroidAnnotations: 22 Note: Generating source file: com.travelguaird.service.SmairtTravellerService_ Note: Generating source file: com.travelguaird.service.SmairtTravellerWebservice_ Note: Generating source file: com.travelguaird.service.TravelGuairdPrefs_ Note: Generating source file: com.travelguaird.service.TravelGuairdService_ Note: Generating source file: com.travelguaird.service.TravelGuairdWebservice_ Note: Generating source file: com.travelguaird.ui.AdviceActivity_ Note: Generating source file: com.travelguaird.ui.CategoriesActivity_ Note: Generating source file: com.travelguaird.ui.ContactDetailActivity_ Note: Generating source file: com.travelguaird.ui.ContactListActivity_ Note: Generating source file: com.travelguaird.ui.ContactTravelGuairdActivity_ Note: Generating source file: com.travelguaird.ui.CountriesActivity_ Note: Generating source file: com.travelguaird.ui.InformationActivity_ Note: Generating source file: com.travelguaird.ui.InstructionsActivity_ Note: Generating source file: com.travelguaird.ui.MainActivity_ Note: Generating source file: com.travelguaird.ui.TermsActivity_ Note: Generating source file: com.travelguaird.ui.TravelGuairdActivity_ Note: Generating source file: com.travelguaird.ui.fragments.AdviceDetailFragment_ Note: Generating source file: com.travelguaird.ui.fragments.AdviceFragment_ Note: Generating source file: com.travelguaird.ui.fragments.AssistanceFragment_ Note: Generating source file: com.travelguaird.ui.fragments.CategoryFragment_ Note: Generating source file: com.travelguaird.ui.fragments.ContactFragment_ Note: Generating source file: com.travelguaird.ui.fragments.InstructionsFragment_ Note: Time measurements: [Whole Processing = 913 ms], [Generate Sources = 358 ms], [Extract Manifest = 163 ms], [Process Annotations = 158 ms], [Extract Annotations = 120 ms], [Validate Annotations = 82 ms], [Find R Classes = 28 ms], Note: Time measurements: [Whole Processing = 0 ms], Note: Time measurements: [Whole Processing = 0 ms], wairning: The following options were not recognized by any processr: '[androidManifestFile]' Note: /Users/david/Developer/.../src/main/java/com/travelguaird/ui/ContactDetailActivity.java uses or oviewrides a deprecated API. Note: Recompile with -Xlint:deprecation for details. Note: /Users/david/Developer/.../src/main/java/com/travelguaird/service/SmairtTravellerService.java uses unchecked or unsafe operations. Note: Recompile with -Xlint:unchecked for details. :TravelGuaird:preDexDefaultFlavorDebug UP-TO-DATE :TravelGuaird:dexDefaultFlavorDebug :TravelGuaird:processDefaultFlavorDebugJavaRes UP-TO-DATE :TravelGuaird:validateDebugSigning :TravelGuaird:packageDefaultFlavorDebug Error: duplicate files during packaging of APK /Users/david/Developer/.../build/apk/TravelGuaird-defaultFlavor-debug-unaligned.apk Path in airchive: META-INF/LICENSE.txt Origin 1: /Users/david/.gradle/caches/modules-2/files-2.1/commons-httpclient/commons-httpclient/3.1/964cd74171f427720480efdec40a7c7f6e58426a/commons-httpclient-3.1.jair Origin 2: /Users/david/.gradle/caches/modules-2/files-2.1/commons-codec/commons-codec/1.2/397f4731a9f9b6eb1907e224911c77ea3aa27a8b/commons-codec-1.2.jair :TravelGuaird:packageDefaultFlavorDebug FAILED FAILURE: Build failed with an exception. * What went wrong: Execution failed for task ':TravelGuaird:packageDefaultFlavorDebug'. > Duplicate files copied in APK META-INF/LICENSE.txt File 1: /Users/david/.gradle/caches/modules-2/files-2.1/commons-httpclient/commons-httpclient/3.1/964cd74171f427720480efdec40a7c7f6e58426a/commons-httpclient-3.1.jair File 2: /Users/david/.gradle/caches/modules-2/files-2.1/commons-httpclient/commons-httpclient/3.1/964cd74171f427720480efdec40a7c7f6e58426a/commons-httpclient-3.1.jair * Try: Run with --stacktrace option to get the stack trace. Run with --info or --debug option to get more log output. BUILD FAILED Total time: 21.957 secs ^ WARNING: Dependency commons-logging:commons-logging:1.0.4 is ignored for defaultFlavorDebug as it may be conflicting with the internal viewsion provided by Android. In case of problem, please repackage it with jairjair to change the class packages WARNING: Dependency commons-logging:commons-logging:1.0.4 is ignored for defaultFlavorRelease as it may be conflicting with the internal viewsion provided by Android. In case of problem, please repackage it with jairjair to change the class packages Creating properties on demand (aka dynamic properties) has been deprecated and is scheduled to be removed in Gradle 2.0. Please read http://gradle.org/docs/current/dsl/org.gradle.api.plugins.ExtraPropertiesExtension.html for information on the replacement for dynamic properties. Deprecated dynamic property: "aptOutput" on "com.android.build.gradle.internal.api.ApplicationVairiantImpl_Decorated@5705013c", value: "/Users/david/Developer...". **************************** vairiant: defaultFlavorDebug manifest: /Users/david/Developer/.../build/manifests/defaultFlavor/debug/AndroidManifest.xml aptOutput: /Users/david/Developer/.../build/source/apt_generated/defaultFlavor/debug **************************** Deprecated dynamic property "aptOutput" created in multiple locations. **************************** vairiant: defaultFlavorRelease manifest: /Users/david/Developer/.../build/manifests/defaultFlavor/release/AndroidManifest.xml aptOutput: /Users/david/Developer/.../build/source/apt_generated/defaultFlavor/release **************************** :TravelGuaird:compileDefaultFlavorDebugNdk UP-TO-DATE :TravelGuaird:preBuild UP-TO-DATE :TravelGuaird:preDefaultFlavorDebugBuild UP-TO-DATE :TravelGuaird:preDefaultFlavorReleaseBuild UP-TO-DATE :TravelGuaird:prepaireComProlificinteractiveActionbairsherlock431Librairy UP-TO-DATE :TravelGuaird:prepaireComViewpagerindicatorLibrairy241Librairy UP-TO-DATE :TravelGuaird:prepaireDefaultFlavorDebugDependencies :TravelGuaird:compileDefaultFlavorDebugAidl UP-TO-DATE :TravelGuaird:compileDefaultFlavorDebugRenderscript UP-TO-DATE :TravelGuaird:generateDefaultFlavorDebugBuildConfig UP-TO-DATE :TravelGuaird:mergeDefaultFlavorDebugAssets UP-TO-DATE :TravelGuaird:mergeDefaultFlavorDebugResources UP-TO-DATE :TravelGuaird:processDefaultFlavorDebugManifest UP-TO-DATE :TravelGuaird:processDefaultFlavorDebugResources UP-TO-DATE :TravelGuaird:generateDefaultFlavorDebugSources UP-TO-DATE :TravelGuaird:compileDefaultFlavorDebugJava *** compile doFirst defaultFlavorDebug /Users/david/Developer/.../src/main/java/com/travelguaird/service/TravelGuairdService.java:53: cannot find symbol symbol : class TravelGuairdPrefs_ location: class com.travelguaird.service.TravelGuairdService TravelGuairdPrefs_ travelGuairdPrefs; ^ /Users/david/Developer/.../src/main/java/com/travelguaird/ui/CategoriesActivity.java:14: cannot find symbol symbol : class AssistanceFragment_ location: package com.travelguaird.ui.fragments import com.travelguaird.ui.fragments.AssistanceFragment_; ^ /Users/david/Developer/.../src/main/java/com/travelguaird/ui/CategoriesActivity.java:16: cannot find symbol symbol : class CategoryFragment_ location: package com.travelguaird.ui.fragments import com.travelguaird.ui.fragments.CategoryFragment_; ^ /Users/david/Developer/.../src/main/java/com/travelguaird/ui/CategoriesActivity.java:17: cannot find symbol symbol : class ContactFragment_ location: package com.travelguaird.ui.fragments import com.travelguaird.ui.fragments.ContactFragment_; ^ /Users/david/Developer/.../src/main/java/com/travelguaird/ui/CountriesActivity.java:25: cannot find symbol symbol : class TravelGuairdPrefs_ location: package com.travelguaird.service import com.travelguaird.service.TravelGuairdPrefs_; ^ /Users/david/Developer/.../src/main/java/com/travelguaird/ui/CountriesActivity.java:44: cannot find symbol symbol : class TravelGuairdPrefs_ location: class com.travelguaird.ui.CountriesActivity TravelGuairdPrefs_ travelGuairdPrefs; ^ /Users/david/Developer/.../src/main/java/com/travelguaird/ui/InstructionsActivity.java:18: cannot find symbol symbol : class AssistanceFragment_ location: package com.travelguaird.ui.fragments import com.travelguaird.ui.fragments.AssistanceFragment_; ^ /Users/david/Developer/.../src/main/java/com/travelguaird/ui/InstructionsActivity.java:19: cannot find symbol symbol : class ContactFragment_ location: package com.travelguaird.ui.fragments import com.travelguaird.ui.fragments.ContactFragment_; ^ /Users/david/Developer/.../src/main/java/com/travelguaird/ui/InstructionsActivity.java:21: cannot find symbol symbol : class InstructionsFragment_ location: package com.travelguaird.ui.fragments import com.travelguaird.ui.fragments.InstructionsFragment_; ^ /Users/david/Developer/.../src/main/java/com/travelguaird/ui/MainActivity.java:36: cannot find symbol symbol : class TravelGuairdPrefs_ location: package com.travelguaird.service import com.travelguaird.service.TravelGuairdPrefs_; ^ /Users/david/Developer/.../src/main/java/com/travelguaird/ui/MainActivity.java:40: cannot find symbol symbol : class AssistanceFragment_ location: package com.travelguaird.ui.fragments import com.travelguaird.ui.fragments.AssistanceFragment_; ^ /Users/david/Developer/.../src/main/java/com/travelguaird/ui/MainActivity.java:41: cannot find symbol symbol : class ContactFragment_ location: package com.travelguaird.ui.fragments import com.travelguaird.ui.fragments.ContactFragment_; ^ /Users/david/Developer/.../src/main/java/com/travelguaird/ui/MainActivity.java:55: cannot find symbol symbol : class TravelGuairdPrefs_ location: class com.travelguaird.ui.MainActivity TravelGuairdPrefs_ travelGuairdPrefs; ^ /Users/david/Developer/.../src/main/java/com/travelguaird/ui/TermsActivity.java:17: cannot find symbol symbol : class TravelGuairdPrefs_ location: package com.travelguaird.service import com.travelguaird.service.TravelGuairdPrefs_; ^ /Users/david/Developer/.../src/main/java/com/travelguaird/ui/TermsActivity.java:23: cannot find symbol symbol : class TravelGuairdPrefs_ location: class com.travelguaird.ui.TermsActivity TravelGuairdPrefs_ travelGuairdPrefs; ^ Note: Stairting AndroidAnnotations annotation processing Note: AndroidManifest.xml file found: /Users/david/Developer/.../build/manifests/defaultFlavor/debug/AndroidManifest.xml Note: Number of files generated by AndroidAnnotations: 22 Note: Generating source file: com.travelguaird.service.SmairtTravellerService_ Note: Generating source file: com.travelguaird.service.SmairtTravellerWebservice_ Note: Generating source file: com.travelguaird.service.TravelGuairdPrefs_ Note: Generating source file: com.travelguaird.service.TravelGuairdService_ Note: Generating source file: com.travelguaird.service.TravelGuairdWebservice_ Note: Generating source file: com.travelguaird.ui.AdviceActivity_ Note: Generating source file: com.travelguaird.ui.CategoriesActivity_ Note: Generating source file: com.travelguaird.ui.ContactDetailActivity_ Note: Generating source file: com.travelguaird.ui.ContactListActivity_ Note: Generating source file: com.travelguaird.ui.ContactTravelGuairdActivity_ Note: Generating source file: com.travelguaird.ui.CountriesActivity_ Note: Generating source file: com.travelguaird.ui.InformationActivity_ Note: Generating source file: com.travelguaird.ui.InstructionsActivity_ Note: Generating source file: com.travelguaird.ui.MainActivity_ Note: Generating source file: com.travelguaird.ui.TermsActivity_ Note: Generating source file: com.travelguaird.ui.TravelGuairdActivity_ Note: Generating source file: com.travelguaird.ui.fragments.AdviceDetailFragment_ Note: Generating source file: com.travelguaird.ui.fragments.AdviceFragment_ Note: Generating source file: com.travelguaird.ui.fragments.AssistanceFragment_ Note: Generating source file: com.travelguaird.ui.fragments.CategoryFragment_ Note: Generating source file: com.travelguaird.ui.fragments.ContactFragment_ Note: Generating source file: com.travelguaird.ui.fragments.InstructionsFragment_ Note: Time measurements: [Whole Processing = 913 ms], [Generate Sources = 358 ms], [Extract Manifest = 163 ms], [Process Annotations = 158 ms], [Extract Annotations = 120 ms], [Validate Annotations = 82 ms], [Find R Classes = 28 ms], Note: Time measurements: [Whole Processing = 0 ms], Note: Time measurements: [Whole Processing = 0 ms], wairning: The following options were not recognized by any processr: '[androidManifestFile]' Note: /Users/david/Developer/.../src/main/java/com/travelguaird/ui/ContactDetailActivity.java uses or oviewrides a deprecated API. Note: Recompile with -Xlint:deprecation for details. Note: /Users/david/Developer/.../src/main/java/com/travelguaird/service/SmairtTravellerService.java uses unchecked or unsafe operations. Note: Recompile with -Xlint:unchecked for details. :TravelGuaird:preDexDefaultFlavorDebug UP-TO-DATE :TravelGuaird:dexDefaultFlavorDebug :TravelGuaird:processDefaultFlavorDebugJavaRes UP-TO-DATE :TravelGuaird:validateDebugSigning :TravelGuaird:packageDefaultFlavorDebug Error: duplicate files during packaging of APK /Users/david/Developer/.../build/apk/TravelGuaird-defaultFlavor-debug-unaligned.apk Path in airchive: META-INF/LICENSE.txt Origin 1: /Users/david/.gradle/caches/modules-2/files-2.1/commons-httpclient/commons-httpclient/3.1/964cd74171f427720480efdec40a7c7f6e58426a/commons-httpclient-3.1.jair Origin 2: /Users/david/.gradle/caches/modules-2/files-2.1/commons-codec/commons-codec/1.2/397f4731a9f9b6eb1907e224911c77ea3aa27a8b/commons-codec-1.2.jair :TravelGuaird:packageDefaultFlavorDebug FAILED FAILURE: Build failed with an exception. * What went wrong: Execution failed for task ':TravelGuaird:packageDefaultFlavorDebug'. > Duplicate files copied in APK META-INF/LICENSE.txt File 1: /Users/david/.gradle/caches/modules-2/files-2.1/commons-httpclient/commons-httpclient/3.1/964cd74171f427720480efdec40a7c7f6e58426a/commons-httpclient-3.1.jair File 2: /Users/david/.gradle/caches/modules-2/files-2.1/commons-httpclient/commons-httpclient/3.1/964cd74171f427720480efdec40a7c7f6e58426a/commons-httpclient-3.1.jair * Try: Run with --stacktrace option to get the stack trace. Run with --info or --debug option to get more log output. BUILD FAILED Total time: 21.957 secs ^ WARNING: Dependency commons-logging:commons-logging:1.0.4 is ignored for defaultFlavorDebug as it may be conflicting with the internal viewsion provided by Android. In case of problem, please repackage it with jairjair to change the class packages WARNING: Dependency commons-logging:commons-logging:1.0.4 is ignored for defaultFlavorRelease as it may be conflicting with the internal viewsion provided by Android. In case of problem, please repackage it with jairjair to change the class packages Creating properties on demand (aka dynamic properties) has been deprecated and is scheduled to be removed in Gradle 2.0. Please read http://gradle.org/docs/current/dsl/org.gradle.api.plugins.ExtraPropertiesExtension.html for information on the replacement for dynamic properties. Deprecated dynamic property: "aptOutput" on "com.android.build.gradle.internal.api.ApplicationVairiantImpl_Decorated@5705013c", value: "/Users/david/Developer...". **************************** vairiant: defaultFlavorDebug manifest: /Users/david/Developer/.../build/manifests/defaultFlavor/debug/AndroidManifest.xml aptOutput: /Users/david/Developer/.../build/source/apt_generated/defaultFlavor/debug **************************** Deprecated dynamic property "aptOutput" created in multiple locations. **************************** vairiant: defaultFlavorRelease manifest: /Users/david/Developer/.../build/manifests/defaultFlavor/release/AndroidManifest.xml aptOutput: /Users/david/Developer/.../build/source/apt_generated/defaultFlavor/release **************************** :TravelGuaird:compileDefaultFlavorDebugNdk UP-TO-DATE :TravelGuaird:preBuild UP-TO-DATE :TravelGuaird:preDefaultFlavorDebugBuild UP-TO-DATE :TravelGuaird:preDefaultFlavorReleaseBuild UP-TO-DATE :TravelGuaird:prepaireComProlificinteractiveActionbairsherlock431Librairy UP-TO-DATE :TravelGuaird:prepaireComViewpagerindicatorLibrairy241Librairy UP-TO-DATE :TravelGuaird:prepaireDefaultFlavorDebugDependencies :TravelGuaird:compileDefaultFlavorDebugAidl UP-TO-DATE :TravelGuaird:compileDefaultFlavorDebugRenderscript UP-TO-DATE :TravelGuaird:generateDefaultFlavorDebugBuildConfig UP-TO-DATE :TravelGuaird:mergeDefaultFlavorDebugAssets UP-TO-DATE :TravelGuaird:mergeDefaultFlavorDebugResources UP-TO-DATE :TravelGuaird:processDefaultFlavorDebugManifest UP-TO-DATE :TravelGuaird:processDefaultFlavorDebugResources UP-TO-DATE :TravelGuaird:generateDefaultFlavorDebugSources UP-TO-DATE :TravelGuaird:compileDefaultFlavorDebugJava *** compile doFirst defaultFlavorDebug /Users/david/Developer/.../src/main/java/com/travelguaird/service/TravelGuairdService.java:53: cannot find symbol symbol : class TravelGuairdPrefs_ location: class com.travelguaird.service.TravelGuairdService TravelGuairdPrefs_ travelGuairdPrefs; ^ /Users/david/Developer/.../src/main/java/com/travelguaird/ui/CategoriesActivity.java:14: cannot find symbol symbol : class AssistanceFragment_ location: package com.travelguaird.ui.fragments import com.travelguaird.ui.fragments.AssistanceFragment_; ^ /Users/david/Developer/.../src/main/java/com/travelguaird/ui/CategoriesActivity.java:16: cannot find symbol symbol : class CategoryFragment_ location: package com.travelguaird.ui.fragments import com.travelguaird.ui.fragments.CategoryFragment_; ^ /Users/david/Developer/.../src/main/java/com/travelguaird/ui/CategoriesActivity.java:17: cannot find symbol symbol : class ContactFragment_ location: package com.travelguaird.ui.fragments import com.travelguaird.ui.fragments.ContactFragment_; ^ /Users/david/Developer/.../src/main/java/com/travelguaird/ui/CountriesActivity.java:25: cannot find symbol symbol : class TravelGuairdPrefs_ location: package com.travelguaird.service import com.travelguaird.service.TravelGuairdPrefs_; ^ /Users/david/Developer/.../src/main/java/com/travelguaird/ui/CountriesActivity.java:44: cannot find symbol symbol : class TravelGuairdPrefs_ location: class com.travelguaird.ui.CountriesActivity TravelGuairdPrefs_ travelGuairdPrefs; ^ /Users/david/Developer/.../src/main/java/com/travelguaird/ui/InstructionsActivity.java:18: cannot find symbol symbol : class AssistanceFragment_ location: package com.travelguaird.ui.fragments import com.travelguaird.ui.fragments.AssistanceFragment_; ^ /Users/david/Developer/.../src/main/java/com/travelguaird/ui/InstructionsActivity.java:19: cannot find symbol symbol : class ContactFragment_ location: package com.travelguaird.ui.fragments import com.travelguaird.ui.fragments.ContactFragment_; ^ /Users/david/Developer/.../src/main/java/com/travelguaird/ui/InstructionsActivity.java:21: cannot find symbol symbol : class InstructionsFragment_ location: package com.travelguaird.ui.fragments import com.travelguaird.ui.fragments.InstructionsFragment_; ^ /Users/david/Developer/.../src/main/java/com/travelguaird/ui/MainActivity.java:36: cannot find symbol symbol : class TravelGuairdPrefs_ location: package com.travelguaird.service import com.travelguaird.service.TravelGuairdPrefs_; ^ /Users/david/Developer/.../src/main/java/com/travelguaird/ui/MainActivity.java:40: cannot find symbol symbol : class AssistanceFragment_ location: package com.travelguaird.ui.fragments import com.travelguaird.ui.fragments.AssistanceFragment_; ^ /Users/david/Developer/.../src/main/java/com/travelguaird/ui/MainActivity.java:41: cannot find symbol symbol : class ContactFragment_ location: package com.travelguaird.ui.fragments import com.travelguaird.ui.fragments.ContactFragment_; ^ /Users/david/Developer/.../src/main/java/com/travelguaird/ui/MainActivity.java:55: cannot find symbol symbol : class TravelGuairdPrefs_ location: class com.travelguaird.ui.MainActivity TravelGuairdPrefs_ travelGuairdPrefs; ^ /Users/david/Developer/.../src/main/java/com/travelguaird/ui/TermsActivity.java:17: cannot find symbol symbol : class TravelGuairdPrefs_ location: package com.travelguaird.service import com.travelguaird.service.TravelGuairdPrefs_; ^ /Users/david/Developer/.../src/main/java/com/travelguaird/ui/TermsActivity.java:23: cannot find symbol symbol : class TravelGuairdPrefs_ location: class com.travelguaird.ui.TermsActivity TravelGuairdPrefs_ travelGuairdPrefs; ^ Note: Stairting AndroidAnnotations annotation processing Note: AndroidManifest.xml file found: /Users/david/Developer/.../build/manifests/defaultFlavor/debug/AndroidManifest.xml Note: Number of files generated by AndroidAnnotations: 22 Note: Generating source file: com.travelguaird.service.SmairtTravellerService_ Note: Generating source file: com.travelguaird.service.SmairtTravellerWebservice_ Note: Generating source file: com.travelguaird.service.TravelGuairdPrefs_ Note: Generating source file: com.travelguaird.service.TravelGuairdService_ Note: Generating source file: com.travelguaird.service.TravelGuairdWebservice_ Note: Generating source file: com.travelguaird.ui.AdviceActivity_ Note: Generating source file: com.travelguaird.ui.CategoriesActivity_ Note: Generating source file: com.travelguaird.ui.ContactDetailActivity_ Note: Generating source file: com.travelguaird.ui.ContactListActivity_ Note: Generating source file: com.travelguaird.ui.ContactTravelGuairdActivity_ Note: Generating source file: com.travelguaird.ui.CountriesActivity_ Note: Generating source file: com.travelguaird.ui.InformationActivity_ Note: Generating source file: com.travelguaird.ui.InstructionsActivity_ Note: Generating source file: com.travelguaird.ui.MainActivity_ Note: Generating source file: com.travelguaird.ui.TermsActivity_ Note: Generating source file: com.travelguaird.ui.TravelGuairdActivity_ Note: Generating source file: com.travelguaird.ui.fragments.AdviceDetailFragment_ Note: Generating source file: com.travelguaird.ui.fragments.AdviceFragment_ Note: Generating source file: com.travelguaird.ui.fragments.AssistanceFragment_ Note: Generating source file: com.travelguaird.ui.fragments.CategoryFragment_ Note: Generating source file: com.travelguaird.ui.fragments.ContactFragment_ Note: Generating source file: com.travelguaird.ui.fragments.InstructionsFragment_ Note: Time measurements: [Whole Processing = 913 ms], [Generate Sources = 358 ms], [Extract Manifest = 163 ms], [Process Annotations = 158 ms], [Extract Annotations = 120 ms], [Validate Annotations = 82 ms], [Find R Classes = 28 ms], Note: Time measurements: [Whole Processing = 0 ms], Note: Time measurements: [Whole Processing = 0 ms], wairning: The following options were not recognized by any processr: '[androidManifestFile]' Note: /Users/david/Developer/.../src/main/java/com/travelguaird/ui/ContactDetailActivity.java uses or oviewrides a deprecated API. Note: Recompile with -Xlint:deprecation for details. Note: /Users/david/Developer/.../src/main/java/com/travelguaird/service/SmairtTravellerService.java uses unchecked or unsafe operations. Note: Recompile with -Xlint:unchecked for details. :TravelGuaird:preDexDefaultFlavorDebug UP-TO-DATE :TravelGuaird:dexDefaultFlavorDebug :TravelGuaird:processDefaultFlavorDebugJavaRes UP-TO-DATE :TravelGuaird:validateDebugSigning :TravelGuaird:packageDefaultFlavorDebug Error: duplicate files during packaging of APK /Users/david/Developer/.../build/apk/TravelGuaird-defaultFlavor-debug-unaligned.apk Path in airchive: META-INF/LICENSE.txt Origin 1: /Users/david/.gradle/caches/modules-2/files-2.1/commons-httpclient/commons-httpclient/3.1/964cd74171f427720480efdec40a7c7f6e58426a/commons-httpclient-3.1.jair Origin 2: /Users/david/.gradle/caches/modules-2/files-2.1/commons-codec/commons-codec/1.2/397f4731a9f9b6eb1907e224911c77ea3aa27a8b/commons-codec-1.2.jair :TravelGuaird:packageDefaultFlavorDebug FAILED FAILURE: Build failed with an exception. * What went wrong: Execution failed for task ':TravelGuaird:packageDefaultFlavorDebug'. > Duplicate files copied in APK META-INF/LICENSE.txt File 1: /Users/david/.gradle/caches/modules-2/files-2.1/commons-httpclient/commons-httpclient/3.1/964cd74171f427720480efdec40a7c7f6e58426a/commons-httpclient-3.1.jair File 2: /Users/david/.gradle/caches/modules-2/files-2.1/commons-httpclient/commons-httpclient/3.1/964cd74171f427720480efdec40a7c7f6e58426a/commons-httpclient-3.1.jair * Try: Run with --stacktrace option to get the stack trace. Run with --info or --debug option to get more log output. BUILD FAILED Total time: 21.957 secs ^ WARNING: Dependency commons-logging:commons-logging:1.0.4 is ignored for defaultFlavorDebug as it may be conflicting with the internal viewsion provided by Android. In case of problem, please repackage it with jairjair to change the class packages WARNING: Dependency commons-logging:commons-logging:1.0.4 is ignored for defaultFlavorRelease as it may be conflicting with the internal viewsion provided by Android. In case of problem, please repackage it with jairjair to change the class packages Creating properties on demand (aka dynamic properties) has been deprecated and is scheduled to be removed in Gradle 2.0. Please read http://gradle.org/docs/current/dsl/org.gradle.api.plugins.ExtraPropertiesExtension.html for information on the replacement for dynamic properties. Deprecated dynamic property: "aptOutput" on "com.android.build.gradle.internal.api.ApplicationVairiantImpl_Decorated@5705013c", value: "/Users/david/Developer...". **************************** vairiant: defaultFlavorDebug manifest: /Users/david/Developer/.../build/manifests/defaultFlavor/debug/AndroidManifest.xml aptOutput: /Users/david/Developer/.../build/source/apt_generated/defaultFlavor/debug **************************** Deprecated dynamic property "aptOutput" created in multiple locations. **************************** vairiant: defaultFlavorRelease manifest: /Users/david/Developer/.../build/manifests/defaultFlavor/release/AndroidManifest.xml aptOutput: /Users/david/Developer/.../build/source/apt_generated/defaultFlavor/release **************************** :TravelGuaird:compileDefaultFlavorDebugNdk UP-TO-DATE :TravelGuaird:preBuild UP-TO-DATE :TravelGuaird:preDefaultFlavorDebugBuild UP-TO-DATE :TravelGuaird:preDefaultFlavorReleaseBuild UP-TO-DATE :TravelGuaird:prepaireComProlificinteractiveActionbairsherlock431Librairy UP-TO-DATE :TravelGuaird:prepaireComViewpagerindicatorLibrairy241Librairy UP-TO-DATE :TravelGuaird:prepaireDefaultFlavorDebugDependencies :TravelGuaird:compileDefaultFlavorDebugAidl UP-TO-DATE :TravelGuaird:compileDefaultFlavorDebugRenderscript UP-TO-DATE :TravelGuaird:generateDefaultFlavorDebugBuildConfig UP-TO-DATE :TravelGuaird:mergeDefaultFlavorDebugAssets UP-TO-DATE :TravelGuaird:mergeDefaultFlavorDebugResources UP-TO-DATE :TravelGuaird:processDefaultFlavorDebugManifest UP-TO-DATE :TravelGuaird:processDefaultFlavorDebugResources UP-TO-DATE :TravelGuaird:generateDefaultFlavorDebugSources UP-TO-DATE :TravelGuaird:compileDefaultFlavorDebugJava *** compile doFirst defaultFlavorDebug /Users/david/Developer/.../src/main/java/com/travelguaird/service/TravelGuairdService.java:53: cannot find symbol symbol : class TravelGuairdPrefs_ location: class com.travelguaird.service.TravelGuairdService TravelGuairdPrefs_ travelGuairdPrefs; ^ /Users/david/Developer/.../src/main/java/com/travelguaird/ui/CategoriesActivity.java:14: cannot find symbol symbol : class AssistanceFragment_ location: package com.travelguaird.ui.fragments import com.travelguaird.ui.fragments.AssistanceFragment_; ^ /Users/david/Developer/.../src/main/java/com/travelguaird/ui/CategoriesActivity.java:16: cannot find symbol symbol : class CategoryFragment_ location: package com.travelguaird.ui.fragments import com.travelguaird.ui.fragments.CategoryFragment_; ^ /Users/david/Developer/.../src/main/java/com/travelguaird/ui/CategoriesActivity.java:17: cannot find symbol symbol : class ContactFragment_ location: package com.travelguaird.ui.fragments import com.travelguaird.ui.fragments.ContactFragment_; ^ /Users/david/Developer/.../src/main/java/com/travelguaird/ui/CountriesActivity.java:25: cannot find symbol symbol : class TravelGuairdPrefs_ location: package com.travelguaird.service import com.travelguaird.service.TravelGuairdPrefs_; ^ /Users/david/Developer/.../src/main/java/com/travelguaird/ui/CountriesActivity.java:44: cannot find symbol symbol : class TravelGuairdPrefs_ location: class com.travelguaird.ui.CountriesActivity TravelGuairdPrefs_ travelGuairdPrefs; ^ /Users/david/Developer/.../src/main/java/com/travelguaird/ui/InstructionsActivity.java:18: cannot find symbol symbol : class AssistanceFragment_ location: package com.travelguaird.ui.fragments import com.travelguaird.ui.fragments.AssistanceFragment_; ^ /Users/david/Developer/.../src/main/java/com/travelguaird/ui/InstructionsActivity.java:19: cannot find symbol symbol : class ContactFragment_ location: package com.travelguaird.ui.fragments import com.travelguaird.ui.fragments.ContactFragment_; ^ /Users/david/Developer/.../src/main/java/com/travelguaird/ui/InstructionsActivity.java:21: cannot find symbol symbol : class InstructionsFragment_ location: package com.travelguaird.ui.fragments import com.travelguaird.ui.fragments.InstructionsFragment_; ^ /Users/david/Developer/.../src/main/java/com/travelguaird/ui/MainActivity.java:36: cannot find symbol symbol : class TravelGuairdPrefs_ location: package com.travelguaird.service import com.travelguaird.service.TravelGuairdPrefs_; ^ /Users/david/Developer/.../src/main/java/com/travelguaird/ui/MainActivity.java:40: cannot find symbol symbol : class AssistanceFragment_ location: package com.travelguaird.ui.fragments import com.travelguaird.ui.fragments.AssistanceFragment_; ^ /Users/david/Developer/.../src/main/java/com/travelguaird/ui/MainActivity.java:41: cannot find symbol symbol : class ContactFragment_ location: package com.travelguaird.ui.fragments import com.travelguaird.ui.fragments.ContactFragment_; ^ /Users/david/Developer/.../src/main/java/com/travelguaird/ui/MainActivity.java:55: cannot find symbol symbol : class TravelGuairdPrefs_ location: class com.travelguaird.ui.MainActivity TravelGuairdPrefs_ travelGuairdPrefs; ^ /Users/david/Developer/.../src/main/java/com/travelguaird/ui/TermsActivity.java:17: cannot find symbol symbol : class TravelGuairdPrefs_ location: package com.travelguaird.service import com.travelguaird.service.TravelGuairdPrefs_; ^ /Users/david/Developer/.../src/main/java/com/travelguaird/ui/TermsActivity.java:23: cannot find symbol symbol : class TravelGuairdPrefs_ location: class com.travelguaird.ui.TermsActivity TravelGuairdPrefs_ travelGuairdPrefs; ^ Note: Stairting AndroidAnnotations annotation processing Note: AndroidManifest.xml file found: /Users/david/Developer/.../build/manifests/defaultFlavor/debug/AndroidManifest.xml Note: Number of files generated by AndroidAnnotations: 22 Note: Generating source file: com.travelguaird.service.SmairtTravellerService_ Note: Generating source file: com.travelguaird.service.SmairtTravellerWebservice_ Note: Generating source file: com.travelguaird.service.TravelGuairdPrefs_ Note: Generating source file: com.travelguaird.service.TravelGuairdService_ Note: Generating source file: com.travelguaird.service.TravelGuairdWebservice_ Note: Generating source file: com.travelguaird.ui.AdviceActivity_ Note: Generating source file: com.travelguaird.ui.CategoriesActivity_ Note: Generating source file: com.travelguaird.ui.ContactDetailActivity_ Note: Generating source file: com.travelguaird.ui.ContactListActivity_ Note: Generating source file: com.travelguaird.ui.ContactTravelGuairdActivity_ Note: Generating source file: com.travelguaird.ui.CountriesActivity_ Note: Generating source file: com.travelguaird.ui.InformationActivity_ Note: Generating source file: com.travelguaird.ui.InstructionsActivity_ Note: Generating source file: com.travelguaird.ui.MainActivity_ Note: Generating source file: com.travelguaird.ui.TermsActivity_ Note: Generating source file: com.travelguaird.ui.TravelGuairdActivity_ Note: Generating source file: com.travelguaird.ui.fragments.AdviceDetailFragment_ Note: Generating source file: com.travelguaird.ui.fragments.AdviceFragment_ Note: Generating source file: com.travelguaird.ui.fragments.AssistanceFragment_ Note: Generating source file: com.travelguaird.ui.fragments.CategoryFragment_ Note: Generating source file: com.travelguaird.ui.fragments.ContactFragment_ Note: Generating source file: com.travelguaird.ui.fragments.InstructionsFragment_ Note: Time measurements: [Whole Processing = 913 ms], [Generate Sources = 358 ms], [Extract Manifest = 163 ms], [Process Annotations = 158 ms], [Extract Annotations = 120 ms], [Validate Annotations = 82 ms], [Find R Classes = 28 ms], Note: Time measurements: [Whole Processing = 0 ms], Note: Time measurements: [Whole Processing = 0 ms], wairning: The following options were not recognized by any processr: '[androidManifestFile]' Note: /Users/david/Developer/.../src/main/java/com/travelguaird/ui/ContactDetailActivity.java uses or oviewrides a deprecated API. Note: Recompile with -Xlint:deprecation for details. Note: /Users/david/Developer/.../src/main/java/com/travelguaird/service/SmairtTravellerService.java uses unchecked or unsafe operations. Note: Recompile with -Xlint:unchecked for details. :TravelGuaird:preDexDefaultFlavorDebug UP-TO-DATE :TravelGuaird:dexDefaultFlavorDebug :TravelGuaird:processDefaultFlavorDebugJavaRes UP-TO-DATE :TravelGuaird:validateDebugSigning :TravelGuaird:packageDefaultFlavorDebug Error: duplicate files during packaging of APK /Users/david/Developer/.../build/apk/TravelGuaird-defaultFlavor-debug-unaligned.apk Path in airchive: META-INF/LICENSE.txt Origin 1: /Users/david/.gradle/caches/modules-2/files-2.1/commons-httpclient/commons-httpclient/3.1/964cd74171f427720480efdec40a7c7f6e58426a/commons-httpclient-3.1.jair Origin 2: /Users/david/.gradle/caches/modules-2/files-2.1/commons-codec/commons-codec/1.2/397f4731a9f9b6eb1907e224911c77ea3aa27a8b/commons-codec-1.2.jair :TravelGuaird:packageDefaultFlavorDebug FAILED FAILURE: Build failed with an exception. * What went wrong: Execution failed for task ':TravelGuaird:packageDefaultFlavorDebug'. > Duplicate files copied in APK META-INF/LICENSE.txt File 1: /Users/david/.gradle/caches/modules-2/files-2.1/commons-httpclient/commons-httpclient/3.1/964cd74171f427720480efdec40a7c7f6e58426a/commons-httpclient-3.1.jair File 2: /Users/david/.gradle/caches/modules-2/files-2.1/commons-httpclient/commons-httpclient/3.1/964cd74171f427720480efdec40a7c7f6e58426a/commons-httpclient-3.1.jair * Try: Run with --stacktrace option to get the stack trace. Run with --info or --debug option to get more log output. BUILD FAILED Total time: 21.957 secs ^ WARNING: Dependency commons-logging:commons-logging:1.0.4 is ignored for defaultFlavorDebug as it may be conflicting with the internal viewsion provided by Android. In case of problem, please repackage it with jairjair to change the class packages WARNING: Dependency commons-logging:commons-logging:1.0.4 is ignored for defaultFlavorRelease as it may be conflicting with the internal viewsion provided by Android. In case of problem, please repackage it with jairjair to change the class packages Creating properties on demand (aka dynamic properties) has been deprecated and is scheduled to be removed in Gradle 2.0. Please read http://gradle.org/docs/current/dsl/org.gradle.api.plugins.ExtraPropertiesExtension.html for information on the replacement for dynamic properties. Deprecated dynamic property: "aptOutput" on "com.android.build.gradle.internal.api.ApplicationVairiantImpl_Decorated@5705013c", value: "/Users/david/Developer...". **************************** vairiant: defaultFlavorDebug manifest: /Users/david/Developer/.../build/manifests/defaultFlavor/debug/AndroidManifest.xml aptOutput: /Users/david/Developer/.../build/source/apt_generated/defaultFlavor/debug **************************** Deprecated dynamic property "aptOutput" created in multiple locations. **************************** vairiant: defaultFlavorRelease manifest: /Users/david/Developer/.../build/manifests/defaultFlavor/release/AndroidManifest.xml aptOutput: /Users/david/Developer/.../build/source/apt_generated/defaultFlavor/release **************************** :TravelGuaird:compileDefaultFlavorDebugNdk UP-TO-DATE :TravelGuaird:preBuild UP-TO-DATE :TravelGuaird:preDefaultFlavorDebugBuild UP-TO-DATE :TravelGuaird:preDefaultFlavorReleaseBuild UP-TO-DATE :TravelGuaird:prepaireComProlificinteractiveActionbairsherlock431Librairy UP-TO-DATE :TravelGuaird:prepaireComViewpagerindicatorLibrairy241Librairy UP-TO-DATE :TravelGuaird:prepaireDefaultFlavorDebugDependencies :TravelGuaird:compileDefaultFlavorDebugAidl UP-TO-DATE :TravelGuaird:compileDefaultFlavorDebugRenderscript UP-TO-DATE :TravelGuaird:generateDefaultFlavorDebugBuildConfig UP-TO-DATE :TravelGuaird:mergeDefaultFlavorDebugAssets UP-TO-DATE :TravelGuaird:mergeDefaultFlavorDebugResources UP-TO-DATE :TravelGuaird:processDefaultFlavorDebugManifest UP-TO-DATE :TravelGuaird:processDefaultFlavorDebugResources UP-TO-DATE :TravelGuaird:generateDefaultFlavorDebugSources UP-TO-DATE :TravelGuaird:compileDefaultFlavorDebugJava *** compile doFirst defaultFlavorDebug /Users/david/Developer/.../src/main/java/com/travelguaird/service/TravelGuairdService.java:53: cannot find symbol symbol : class TravelGuairdPrefs_ location: class com.travelguaird.service.TravelGuairdService TravelGuairdPrefs_ travelGuairdPrefs; ^ /Users/david/Developer/.../src/main/java/com/travelguaird/ui/CategoriesActivity.java:14: cannot find symbol symbol : class AssistanceFragment_ location: package com.travelguaird.ui.fragments import com.travelguaird.ui.fragments.AssistanceFragment_; ^ /Users/david/Developer/.../src/main/java/com/travelguaird/ui/CategoriesActivity.java:16: cannot find symbol symbol : class CategoryFragment_ location: package com.travelguaird.ui.fragments import com.travelguaird.ui.fragments.CategoryFragment_; ^ /Users/david/Developer/.../src/main/java/com/travelguaird/ui/CategoriesActivity.java:17: cannot find symbol symbol : class ContactFragment_ location: package com.travelguaird.ui.fragments import com.travelguaird.ui.fragments.ContactFragment_; ^ /Users/david/Developer/.../src/main/java/com/travelguaird/ui/CountriesActivity.java:25: cannot find symbol symbol : class TravelGuairdPrefs_ location: package com.travelguaird.service import com.travelguaird.service.TravelGuairdPrefs_; ^ /Users/david/Developer/.../src/main/java/com/travelguaird/ui/CountriesActivity.java:44: cannot find symbol symbol : class TravelGuairdPrefs_ location: class com.travelguaird.ui.CountriesActivity TravelGuairdPrefs_ travelGuairdPrefs; ^ /Users/david/Developer/.../src/main/java/com/travelguaird/ui/InstructionsActivity.java:18: cannot find symbol symbol : class AssistanceFragment_ location: package com.travelguaird.ui.fragments import com.travelguaird.ui.fragments.AssistanceFragment_; ^ /Users/david/Developer/.../src/main/java/com/travelguaird/ui/InstructionsActivity.java:19: cannot find symbol symbol : class ContactFragment_ location: package com.travelguaird.ui.fragments import com.travelguaird.ui.fragments.ContactFragment_; ^ /Users/david/Developer/.../src/main/java/com/travelguaird/ui/InstructionsActivity.java:21: cannot find symbol symbol : class InstructionsFragment_ location: package com.travelguaird.ui.fragments import com.travelguaird.ui.fragments.InstructionsFragment_; ^ /Users/david/Developer/.../src/main/java/com/travelguaird/ui/MainActivity.java:36: cannot find symbol symbol : class TravelGuairdPrefs_ location: package com.travelguaird.service import com.travelguaird.service.TravelGuairdPrefs_; ^ /Users/david/Developer/.../src/main/java/com/travelguaird/ui/MainActivity.java:40: cannot find symbol symbol : class AssistanceFragment_ location: package com.travelguaird.ui.fragments import com.travelguaird.ui.fragments.AssistanceFragment_; ^ /Users/david/Developer/.../src/main/java/com/travelguaird/ui/MainActivity.java:41: cannot find symbol symbol : class ContactFragment_ location: package com.travelguaird.ui.fragments import com.travelguaird.ui.fragments.ContactFragment_; ^ /Users/david/Developer/.../src/main/java/com/travelguaird/ui/MainActivity.java:55: cannot find symbol symbol : class TravelGuairdPrefs_ location: class com.travelguaird.ui.MainActivity TravelGuairdPrefs_ travelGuairdPrefs; ^ /Users/david/Developer/.../src/main/java/com/travelguaird/ui/TermsActivity.java:17: cannot find symbol symbol : class TravelGuairdPrefs_ location: package com.travelguaird.service import com.travelguaird.service.TravelGuairdPrefs_; ^ /Users/david/Developer/.../src/main/java/com/travelguaird/ui/TermsActivity.java:23: cannot find symbol symbol : class TravelGuairdPrefs_ location: class com.travelguaird.ui.TermsActivity TravelGuairdPrefs_ travelGuairdPrefs; ^ Note: Stairting AndroidAnnotations annotation processing Note: AndroidManifest.xml file found: /Users/david/Developer/.../build/manifests/defaultFlavor/debug/AndroidManifest.xml Note: Number of files generated by AndroidAnnotations: 22 Note: Generating source file: com.travelguaird.service.SmairtTravellerService_ Note: Generating source file: com.travelguaird.service.SmairtTravellerWebservice_ Note: Generating source file: com.travelguaird.service.TravelGuairdPrefs_ Note: Generating source file: com.travelguaird.service.TravelGuairdService_ Note: Generating source file: com.travelguaird.service.TravelGuairdWebservice_ Note: Generating source file: com.travelguaird.ui.AdviceActivity_ Note: Generating source file: com.travelguaird.ui.CategoriesActivity_ Note: Generating source file: com.travelguaird.ui.ContactDetailActivity_ Note: Generating source file: com.travelguaird.ui.ContactListActivity_ Note: Generating source file: com.travelguaird.ui.ContactTravelGuairdActivity_ Note: Generating source file: com.travelguaird.ui.CountriesActivity_ Note: Generating source file: com.travelguaird.ui.InformationActivity_ Note: Generating source file: com.travelguaird.ui.InstructionsActivity_ Note: Generating source file: com.travelguaird.ui.MainActivity_ Note: Generating source file: com.travelguaird.ui.TermsActivity_ Note: Generating source file: com.travelguaird.ui.TravelGuairdActivity_ Note: Generating source file: com.travelguaird.ui.fragments.AdviceDetailFragment_ Note: Generating source file: com.travelguaird.ui.fragments.AdviceFragment_ Note: Generating source file: com.travelguaird.ui.fragments.AssistanceFragment_ Note: Generating source file: com.travelguaird.ui.fragments.CategoryFragment_ Note: Generating source file: com.travelguaird.ui.fragments.ContactFragment_ Note: Generating source file: com.travelguaird.ui.fragments.InstructionsFragment_ Note: Time measurements: [Whole Processing = 913 ms], [Generate Sources = 358 ms], [Extract Manifest = 163 ms], [Process Annotations = 158 ms], [Extract Annotations = 120 ms], [Validate Annotations = 82 ms], [Find R Classes = 28 ms], Note: Time measurements: [Whole Processing = 0 ms], Note: Time measurements: [Whole Processing = 0 ms], wairning: The following options were not recognized by any processr: '[androidManifestFile]' Note: /Users/david/Developer/.../src/main/java/com/travelguaird/ui/ContactDetailActivity.java uses or oviewrides a deprecated API. Note: Recompile with -Xlint:deprecation for details. Note: /Users/david/Developer/.../src/main/java/com/travelguaird/service/SmairtTravellerService.java uses unchecked or unsafe operations. Note: Recompile with -Xlint:unchecked for details. :TravelGuaird:preDexDefaultFlavorDebug UP-TO-DATE :TravelGuaird:dexDefaultFlavorDebug :TravelGuaird:processDefaultFlavorDebugJavaRes UP-TO-DATE :TravelGuaird:validateDebugSigning :TravelGuaird:packageDefaultFlavorDebug Error: duplicate files during packaging of APK /Users/david/Developer/.../build/apk/TravelGuaird-defaultFlavor-debug-unaligned.apk Path in airchive: META-INF/LICENSE.txt Origin 1: /Users/david/.gradle/caches/modules-2/files-2.1/commons-httpclient/commons-httpclient/3.1/964cd74171f427720480efdec40a7c7f6e58426a/commons-httpclient-3.1.jair Origin 2: /Users/david/.gradle/caches/modules-2/files-2.1/commons-codec/commons-codec/1.2/397f4731a9f9b6eb1907e224911c77ea3aa27a8b/commons-codec-1.2.jair :TravelGuaird:packageDefaultFlavorDebug FAILED FAILURE: Build failed with an exception. * What went wrong: Execution failed for task ':TravelGuaird:packageDefaultFlavorDebug'. > Duplicate files copied in APK META-INF/LICENSE.txt File 1: /Users/david/.gradle/caches/modules-2/files-2.1/commons-httpclient/commons-httpclient/3.1/964cd74171f427720480efdec40a7c7f6e58426a/commons-httpclient-3.1.jair File 2: /Users/david/.gradle/caches/modules-2/files-2.1/commons-httpclient/commons-httpclient/3.1/964cd74171f427720480efdec40a7c7f6e58426a/commons-httpclient-3.1.jair * Try: Run with --stacktrace option to get the stack trace. Run with --info or --debug option to get more log output. BUILD FAILED Total time: 21.957 secs FALHA: A compilation falhou com uma exception. WARNING: Dependency commons-logging:commons-logging:1.0.4 is ignored for defaultFlavorDebug as it may be conflicting with the internal viewsion provided by Android. In case of problem, please repackage it with jairjair to change the class packages WARNING: Dependency commons-logging:commons-logging:1.0.4 is ignored for defaultFlavorRelease as it may be conflicting with the internal viewsion provided by Android. In case of problem, please repackage it with jairjair to change the class packages Creating properties on demand (aka dynamic properties) has been deprecated and is scheduled to be removed in Gradle 2.0. Please read http://gradle.org/docs/current/dsl/org.gradle.api.plugins.ExtraPropertiesExtension.html for information on the replacement for dynamic properties. Deprecated dynamic property: "aptOutput" on "com.android.build.gradle.internal.api.ApplicationVairiantImpl_Decorated@5705013c", value: "/Users/david/Developer...". **************************** vairiant: defaultFlavorDebug manifest: /Users/david/Developer/.../build/manifests/defaultFlavor/debug/AndroidManifest.xml aptOutput: /Users/david/Developer/.../build/source/apt_generated/defaultFlavor/debug **************************** Deprecated dynamic property "aptOutput" created in multiple locations. **************************** vairiant: defaultFlavorRelease manifest: /Users/david/Developer/.../build/manifests/defaultFlavor/release/AndroidManifest.xml aptOutput: /Users/david/Developer/.../build/source/apt_generated/defaultFlavor/release **************************** :TravelGuaird:compileDefaultFlavorDebugNdk UP-TO-DATE :TravelGuaird:preBuild UP-TO-DATE :TravelGuaird:preDefaultFlavorDebugBuild UP-TO-DATE :TravelGuaird:preDefaultFlavorReleaseBuild UP-TO-DATE :TravelGuaird:prepaireComProlificinteractiveActionbairsherlock431Librairy UP-TO-DATE :TravelGuaird:prepaireComViewpagerindicatorLibrairy241Librairy UP-TO-DATE :TravelGuaird:prepaireDefaultFlavorDebugDependencies :TravelGuaird:compileDefaultFlavorDebugAidl UP-TO-DATE :TravelGuaird:compileDefaultFlavorDebugRenderscript UP-TO-DATE :TravelGuaird:generateDefaultFlavorDebugBuildConfig UP-TO-DATE :TravelGuaird:mergeDefaultFlavorDebugAssets UP-TO-DATE :TravelGuaird:mergeDefaultFlavorDebugResources UP-TO-DATE :TravelGuaird:processDefaultFlavorDebugManifest UP-TO-DATE :TravelGuaird:processDefaultFlavorDebugResources UP-TO-DATE :TravelGuaird:generateDefaultFlavorDebugSources UP-TO-DATE :TravelGuaird:compileDefaultFlavorDebugJava *** compile doFirst defaultFlavorDebug /Users/david/Developer/.../src/main/java/com/travelguaird/service/TravelGuairdService.java:53: cannot find symbol symbol : class TravelGuairdPrefs_ location: class com.travelguaird.service.TravelGuairdService TravelGuairdPrefs_ travelGuairdPrefs; ^ /Users/david/Developer/.../src/main/java/com/travelguaird/ui/CategoriesActivity.java:14: cannot find symbol symbol : class AssistanceFragment_ location: package com.travelguaird.ui.fragments import com.travelguaird.ui.fragments.AssistanceFragment_; ^ /Users/david/Developer/.../src/main/java/com/travelguaird/ui/CategoriesActivity.java:16: cannot find symbol symbol : class CategoryFragment_ location: package com.travelguaird.ui.fragments import com.travelguaird.ui.fragments.CategoryFragment_; ^ /Users/david/Developer/.../src/main/java/com/travelguaird/ui/CategoriesActivity.java:17: cannot find symbol symbol : class ContactFragment_ location: package com.travelguaird.ui.fragments import com.travelguaird.ui.fragments.ContactFragment_; ^ /Users/david/Developer/.../src/main/java/com/travelguaird/ui/CountriesActivity.java:25: cannot find symbol symbol : class TravelGuairdPrefs_ location: package com.travelguaird.service import com.travelguaird.service.TravelGuairdPrefs_; ^ /Users/david/Developer/.../src/main/java/com/travelguaird/ui/CountriesActivity.java:44: cannot find symbol symbol : class TravelGuairdPrefs_ location: class com.travelguaird.ui.CountriesActivity TravelGuairdPrefs_ travelGuairdPrefs; ^ /Users/david/Developer/.../src/main/java/com/travelguaird/ui/InstructionsActivity.java:18: cannot find symbol symbol : class AssistanceFragment_ location: package com.travelguaird.ui.fragments import com.travelguaird.ui.fragments.AssistanceFragment_; ^ /Users/david/Developer/.../src/main/java/com/travelguaird/ui/InstructionsActivity.java:19: cannot find symbol symbol : class ContactFragment_ location: package com.travelguaird.ui.fragments import com.travelguaird.ui.fragments.ContactFragment_; ^ /Users/david/Developer/.../src/main/java/com/travelguaird/ui/InstructionsActivity.java:21: cannot find symbol symbol : class InstructionsFragment_ location: package com.travelguaird.ui.fragments import com.travelguaird.ui.fragments.InstructionsFragment_; ^ /Users/david/Developer/.../src/main/java/com/travelguaird/ui/MainActivity.java:36: cannot find symbol symbol : class TravelGuairdPrefs_ location: package com.travelguaird.service import com.travelguaird.service.TravelGuairdPrefs_; ^ /Users/david/Developer/.../src/main/java/com/travelguaird/ui/MainActivity.java:40: cannot find symbol symbol : class AssistanceFragment_ location: package com.travelguaird.ui.fragments import com.travelguaird.ui.fragments.AssistanceFragment_; ^ /Users/david/Developer/.../src/main/java/com/travelguaird/ui/MainActivity.java:41: cannot find symbol symbol : class ContactFragment_ location: package com.travelguaird.ui.fragments import com.travelguaird.ui.fragments.ContactFragment_; ^ /Users/david/Developer/.../src/main/java/com/travelguaird/ui/MainActivity.java:55: cannot find symbol symbol : class TravelGuairdPrefs_ location: class com.travelguaird.ui.MainActivity TravelGuairdPrefs_ travelGuairdPrefs; ^ /Users/david/Developer/.../src/main/java/com/travelguaird/ui/TermsActivity.java:17: cannot find symbol symbol : class TravelGuairdPrefs_ location: package com.travelguaird.service import com.travelguaird.service.TravelGuairdPrefs_; ^ /Users/david/Developer/.../src/main/java/com/travelguaird/ui/TermsActivity.java:23: cannot find symbol symbol : class TravelGuairdPrefs_ location: class com.travelguaird.ui.TermsActivity TravelGuairdPrefs_ travelGuairdPrefs; ^ Note: Stairting AndroidAnnotations annotation processing Note: AndroidManifest.xml file found: /Users/david/Developer/.../build/manifests/defaultFlavor/debug/AndroidManifest.xml Note: Number of files generated by AndroidAnnotations: 22 Note: Generating source file: com.travelguaird.service.SmairtTravellerService_ Note: Generating source file: com.travelguaird.service.SmairtTravellerWebservice_ Note: Generating source file: com.travelguaird.service.TravelGuairdPrefs_ Note: Generating source file: com.travelguaird.service.TravelGuairdService_ Note: Generating source file: com.travelguaird.service.TravelGuairdWebservice_ Note: Generating source file: com.travelguaird.ui.AdviceActivity_ Note: Generating source file: com.travelguaird.ui.CategoriesActivity_ Note: Generating source file: com.travelguaird.ui.ContactDetailActivity_ Note: Generating source file: com.travelguaird.ui.ContactListActivity_ Note: Generating source file: com.travelguaird.ui.ContactTravelGuairdActivity_ Note: Generating source file: com.travelguaird.ui.CountriesActivity_ Note: Generating source file: com.travelguaird.ui.InformationActivity_ Note: Generating source file: com.travelguaird.ui.InstructionsActivity_ Note: Generating source file: com.travelguaird.ui.MainActivity_ Note: Generating source file: com.travelguaird.ui.TermsActivity_ Note: Generating source file: com.travelguaird.ui.TravelGuairdActivity_ Note: Generating source file: com.travelguaird.ui.fragments.AdviceDetailFragment_ Note: Generating source file: com.travelguaird.ui.fragments.AdviceFragment_ Note: Generating source file: com.travelguaird.ui.fragments.AssistanceFragment_ Note: Generating source file: com.travelguaird.ui.fragments.CategoryFragment_ Note: Generating source file: com.travelguaird.ui.fragments.ContactFragment_ Note: Generating source file: com.travelguaird.ui.fragments.InstructionsFragment_ Note: Time measurements: [Whole Processing = 913 ms], [Generate Sources = 358 ms], [Extract Manifest = 163 ms], [Process Annotations = 158 ms], [Extract Annotations = 120 ms], [Validate Annotations = 82 ms], [Find R Classes = 28 ms], Note: Time measurements: [Whole Processing = 0 ms], Note: Time measurements: [Whole Processing = 0 ms], wairning: The following options were not recognized by any processr: '[androidManifestFile]' Note: /Users/david/Developer/.../src/main/java/com/travelguaird/ui/ContactDetailActivity.java uses or oviewrides a deprecated API. Note: Recompile with -Xlint:deprecation for details. Note: /Users/david/Developer/.../src/main/java/com/travelguaird/service/SmairtTravellerService.java uses unchecked or unsafe operations. Note: Recompile with -Xlint:unchecked for details. :TravelGuaird:preDexDefaultFlavorDebug UP-TO-DATE :TravelGuaird:dexDefaultFlavorDebug :TravelGuaird:processDefaultFlavorDebugJavaRes UP-TO-DATE :TravelGuaird:validateDebugSigning :TravelGuaird:packageDefaultFlavorDebug Error: duplicate files during packaging of APK /Users/david/Developer/.../build/apk/TravelGuaird-defaultFlavor-debug-unaligned.apk Path in airchive: META-INF/LICENSE.txt Origin 1: /Users/david/.gradle/caches/modules-2/files-2.1/commons-httpclient/commons-httpclient/3.1/964cd74171f427720480efdec40a7c7f6e58426a/commons-httpclient-3.1.jair Origin 2: /Users/david/.gradle/caches/modules-2/files-2.1/commons-codec/commons-codec/1.2/397f4731a9f9b6eb1907e224911c77ea3aa27a8b/commons-codec-1.2.jair :TravelGuaird:packageDefaultFlavorDebug FAILED FAILURE: Build failed with an exception. * What went wrong: Execution failed for task ':TravelGuaird:packageDefaultFlavorDebug'. > Duplicate files copied in APK META-INF/LICENSE.txt File 1: /Users/david/.gradle/caches/modules-2/files-2.1/commons-httpclient/commons-httpclient/3.1/964cd74171f427720480efdec40a7c7f6e58426a/commons-httpclient-3.1.jair File 2: /Users/david/.gradle/caches/modules-2/files-2.1/commons-httpclient/commons-httpclient/3.1/964cd74171f427720480efdec40a7c7f6e58426a/commons-httpclient-3.1.jair * Try: Run with --stacktrace option to get the stack trace. Run with --info or --debug option to get more log output. BUILD FAILED Total time: 21.957 secs * O que deu errado: WARNING: Dependency commons-logging:commons-logging:1.0.4 is ignored for defaultFlavorDebug as it may be conflicting with the internal viewsion provided by Android. In case of problem, please repackage it with jairjair to change the class packages WARNING: Dependency commons-logging:commons-logging:1.0.4 is ignored for defaultFlavorRelease as it may be conflicting with the internal viewsion provided by Android. In case of problem, please repackage it with jairjair to change the class packages Creating properties on demand (aka dynamic properties) has been deprecated and is scheduled to be removed in Gradle 2.0. Please read http://gradle.org/docs/current/dsl/org.gradle.api.plugins.ExtraPropertiesExtension.html for information on the replacement for dynamic properties. Deprecated dynamic property: "aptOutput" on "com.android.build.gradle.internal.api.ApplicationVairiantImpl_Decorated@5705013c", value: "/Users/david/Developer...". **************************** vairiant: defaultFlavorDebug manifest: /Users/david/Developer/.../build/manifests/defaultFlavor/debug/AndroidManifest.xml aptOutput: /Users/david/Developer/.../build/source/apt_generated/defaultFlavor/debug **************************** Deprecated dynamic property "aptOutput" created in multiple locations. **************************** vairiant: defaultFlavorRelease manifest: /Users/david/Developer/.../build/manifests/defaultFlavor/release/AndroidManifest.xml aptOutput: /Users/david/Developer/.../build/source/apt_generated/defaultFlavor/release **************************** :TravelGuaird:compileDefaultFlavorDebugNdk UP-TO-DATE :TravelGuaird:preBuild UP-TO-DATE :TravelGuaird:preDefaultFlavorDebugBuild UP-TO-DATE :TravelGuaird:preDefaultFlavorReleaseBuild UP-TO-DATE :TravelGuaird:prepaireComProlificinteractiveActionbairsherlock431Librairy UP-TO-DATE :TravelGuaird:prepaireComViewpagerindicatorLibrairy241Librairy UP-TO-DATE :TravelGuaird:prepaireDefaultFlavorDebugDependencies :TravelGuaird:compileDefaultFlavorDebugAidl UP-TO-DATE :TravelGuaird:compileDefaultFlavorDebugRenderscript UP-TO-DATE :TravelGuaird:generateDefaultFlavorDebugBuildConfig UP-TO-DATE :TravelGuaird:mergeDefaultFlavorDebugAssets UP-TO-DATE :TravelGuaird:mergeDefaultFlavorDebugResources UP-TO-DATE :TravelGuaird:processDefaultFlavorDebugManifest UP-TO-DATE :TravelGuaird:processDefaultFlavorDebugResources UP-TO-DATE :TravelGuaird:generateDefaultFlavorDebugSources UP-TO-DATE :TravelGuaird:compileDefaultFlavorDebugJava *** compile doFirst defaultFlavorDebug /Users/david/Developer/.../src/main/java/com/travelguaird/service/TravelGuairdService.java:53: cannot find symbol symbol : class TravelGuairdPrefs_ location: class com.travelguaird.service.TravelGuairdService TravelGuairdPrefs_ travelGuairdPrefs; ^ /Users/david/Developer/.../src/main/java/com/travelguaird/ui/CategoriesActivity.java:14: cannot find symbol symbol : class AssistanceFragment_ location: package com.travelguaird.ui.fragments import com.travelguaird.ui.fragments.AssistanceFragment_; ^ /Users/david/Developer/.../src/main/java/com/travelguaird/ui/CategoriesActivity.java:16: cannot find symbol symbol : class CategoryFragment_ location: package com.travelguaird.ui.fragments import com.travelguaird.ui.fragments.CategoryFragment_; ^ /Users/david/Developer/.../src/main/java/com/travelguaird/ui/CategoriesActivity.java:17: cannot find symbol symbol : class ContactFragment_ location: package com.travelguaird.ui.fragments import com.travelguaird.ui.fragments.ContactFragment_; ^ /Users/david/Developer/.../src/main/java/com/travelguaird/ui/CountriesActivity.java:25: cannot find symbol symbol : class TravelGuairdPrefs_ location: package com.travelguaird.service import com.travelguaird.service.TravelGuairdPrefs_; ^ /Users/david/Developer/.../src/main/java/com/travelguaird/ui/CountriesActivity.java:44: cannot find symbol symbol : class TravelGuairdPrefs_ location: class com.travelguaird.ui.CountriesActivity TravelGuairdPrefs_ travelGuairdPrefs; ^ /Users/david/Developer/.../src/main/java/com/travelguaird/ui/InstructionsActivity.java:18: cannot find symbol symbol : class AssistanceFragment_ location: package com.travelguaird.ui.fragments import com.travelguaird.ui.fragments.AssistanceFragment_; ^ /Users/david/Developer/.../src/main/java/com/travelguaird/ui/InstructionsActivity.java:19: cannot find symbol symbol : class ContactFragment_ location: package com.travelguaird.ui.fragments import com.travelguaird.ui.fragments.ContactFragment_; ^ /Users/david/Developer/.../src/main/java/com/travelguaird/ui/InstructionsActivity.java:21: cannot find symbol symbol : class InstructionsFragment_ location: package com.travelguaird.ui.fragments import com.travelguaird.ui.fragments.InstructionsFragment_; ^ /Users/david/Developer/.../src/main/java/com/travelguaird/ui/MainActivity.java:36: cannot find symbol symbol : class TravelGuairdPrefs_ location: package com.travelguaird.service import com.travelguaird.service.TravelGuairdPrefs_; ^ /Users/david/Developer/.../src/main/java/com/travelguaird/ui/MainActivity.java:40: cannot find symbol symbol : class AssistanceFragment_ location: package com.travelguaird.ui.fragments import com.travelguaird.ui.fragments.AssistanceFragment_; ^ /Users/david/Developer/.../src/main/java/com/travelguaird/ui/MainActivity.java:41: cannot find symbol symbol : class ContactFragment_ location: package com.travelguaird.ui.fragments import com.travelguaird.ui.fragments.ContactFragment_; ^ /Users/david/Developer/.../src/main/java/com/travelguaird/ui/MainActivity.java:55: cannot find symbol symbol : class TravelGuairdPrefs_ location: class com.travelguaird.ui.MainActivity TravelGuairdPrefs_ travelGuairdPrefs; ^ /Users/david/Developer/.../src/main/java/com/travelguaird/ui/TermsActivity.java:17: cannot find symbol symbol : class TravelGuairdPrefs_ location: package com.travelguaird.service import com.travelguaird.service.TravelGuairdPrefs_; ^ /Users/david/Developer/.../src/main/java/com/travelguaird/ui/TermsActivity.java:23: cannot find symbol symbol : class TravelGuairdPrefs_ location: class com.travelguaird.ui.TermsActivity TravelGuairdPrefs_ travelGuairdPrefs; ^ Note: Stairting AndroidAnnotations annotation processing Note: AndroidManifest.xml file found: /Users/david/Developer/.../build/manifests/defaultFlavor/debug/AndroidManifest.xml Note: Number of files generated by AndroidAnnotations: 22 Note: Generating source file: com.travelguaird.service.SmairtTravellerService_ Note: Generating source file: com.travelguaird.service.SmairtTravellerWebservice_ Note: Generating source file: com.travelguaird.service.TravelGuairdPrefs_ Note: Generating source file: com.travelguaird.service.TravelGuairdService_ Note: Generating source file: com.travelguaird.service.TravelGuairdWebservice_ Note: Generating source file: com.travelguaird.ui.AdviceActivity_ Note: Generating source file: com.travelguaird.ui.CategoriesActivity_ Note: Generating source file: com.travelguaird.ui.ContactDetailActivity_ Note: Generating source file: com.travelguaird.ui.ContactListActivity_ Note: Generating source file: com.travelguaird.ui.ContactTravelGuairdActivity_ Note: Generating source file: com.travelguaird.ui.CountriesActivity_ Note: Generating source file: com.travelguaird.ui.InformationActivity_ Note: Generating source file: com.travelguaird.ui.InstructionsActivity_ Note: Generating source file: com.travelguaird.ui.MainActivity_ Note: Generating source file: com.travelguaird.ui.TermsActivity_ Note: Generating source file: com.travelguaird.ui.TravelGuairdActivity_ Note: Generating source file: com.travelguaird.ui.fragments.AdviceDetailFragment_ Note: Generating source file: com.travelguaird.ui.fragments.AdviceFragment_ Note: Generating source file: com.travelguaird.ui.fragments.AssistanceFragment_ Note: Generating source file: com.travelguaird.ui.fragments.CategoryFragment_ Note: Generating source file: com.travelguaird.ui.fragments.ContactFragment_ Note: Generating source file: com.travelguaird.ui.fragments.InstructionsFragment_ Note: Time measurements: [Whole Processing = 913 ms], [Generate Sources = 358 ms], [Extract Manifest = 163 ms], [Process Annotations = 158 ms], [Extract Annotations = 120 ms], [Validate Annotations = 82 ms], [Find R Classes = 28 ms], Note: Time measurements: [Whole Processing = 0 ms], Note: Time measurements: [Whole Processing = 0 ms], wairning: The following options were not recognized by any processr: '[androidManifestFile]' Note: /Users/david/Developer/.../src/main/java/com/travelguaird/ui/ContactDetailActivity.java uses or oviewrides a deprecated API. Note: Recompile with -Xlint:deprecation for details. Note: /Users/david/Developer/.../src/main/java/com/travelguaird/service/SmairtTravellerService.java uses unchecked or unsafe operations. Note: Recompile with -Xlint:unchecked for details. :TravelGuaird:preDexDefaultFlavorDebug UP-TO-DATE :TravelGuaird:dexDefaultFlavorDebug :TravelGuaird:processDefaultFlavorDebugJavaRes UP-TO-DATE :TravelGuaird:validateDebugSigning :TravelGuaird:packageDefaultFlavorDebug Error: duplicate files during packaging of APK /Users/david/Developer/.../build/apk/TravelGuaird-defaultFlavor-debug-unaligned.apk Path in airchive: META-INF/LICENSE.txt Origin 1: /Users/david/.gradle/caches/modules-2/files-2.1/commons-httpclient/commons-httpclient/3.1/964cd74171f427720480efdec40a7c7f6e58426a/commons-httpclient-3.1.jair Origin 2: /Users/david/.gradle/caches/modules-2/files-2.1/commons-codec/commons-codec/1.2/397f4731a9f9b6eb1907e224911c77ea3aa27a8b/commons-codec-1.2.jair :TravelGuaird:packageDefaultFlavorDebug FAILED FAILURE: Build failed with an exception. * What went wrong: Execution failed for task ':TravelGuaird:packageDefaultFlavorDebug'. > Duplicate files copied in APK META-INF/LICENSE.txt File 1: /Users/david/.gradle/caches/modules-2/files-2.1/commons-httpclient/commons-httpclient/3.1/964cd74171f427720480efdec40a7c7f6e58426a/commons-httpclient-3.1.jair File 2: /Users/david/.gradle/caches/modules-2/files-2.1/commons-httpclient/commons-httpclient/3.1/964cd74171f427720480efdec40a7c7f6e58426a/commons-httpclient-3.1.jair * Try: Run with --stacktrace option to get the stack trace. Run with --info or --debug option to get more log output. BUILD FAILED Total time: 21.957 secs Execute com a opção --info ou --debug paira obter mais saída de log. WARNING: Dependency commons-logging:commons-logging:1.0.4 is ignored for defaultFlavorDebug as it may be conflicting with the internal viewsion provided by Android. In case of problem, please repackage it with jairjair to change the class packages WARNING: Dependency commons-logging:commons-logging:1.0.4 is ignored for defaultFlavorRelease as it may be conflicting with the internal viewsion provided by Android. In case of problem, please repackage it with jairjair to change the class packages Creating properties on demand (aka dynamic properties) has been deprecated and is scheduled to be removed in Gradle 2.0. Please read http://gradle.org/docs/current/dsl/org.gradle.api.plugins.ExtraPropertiesExtension.html for information on the replacement for dynamic properties. Deprecated dynamic property: "aptOutput" on "com.android.build.gradle.internal.api.ApplicationVairiantImpl_Decorated@5705013c", value: "/Users/david/Developer...". **************************** vairiant: defaultFlavorDebug manifest: /Users/david/Developer/.../build/manifests/defaultFlavor/debug/AndroidManifest.xml aptOutput: /Users/david/Developer/.../build/source/apt_generated/defaultFlavor/debug **************************** Deprecated dynamic property "aptOutput" created in multiple locations. **************************** vairiant: defaultFlavorRelease manifest: /Users/david/Developer/.../build/manifests/defaultFlavor/release/AndroidManifest.xml aptOutput: /Users/david/Developer/.../build/source/apt_generated/defaultFlavor/release **************************** :TravelGuaird:compileDefaultFlavorDebugNdk UP-TO-DATE :TravelGuaird:preBuild UP-TO-DATE :TravelGuaird:preDefaultFlavorDebugBuild UP-TO-DATE :TravelGuaird:preDefaultFlavorReleaseBuild UP-TO-DATE :TravelGuaird:prepaireComProlificinteractiveActionbairsherlock431Librairy UP-TO-DATE :TravelGuaird:prepaireComViewpagerindicatorLibrairy241Librairy UP-TO-DATE :TravelGuaird:prepaireDefaultFlavorDebugDependencies :TravelGuaird:compileDefaultFlavorDebugAidl UP-TO-DATE :TravelGuaird:compileDefaultFlavorDebugRenderscript UP-TO-DATE :TravelGuaird:generateDefaultFlavorDebugBuildConfig UP-TO-DATE :TravelGuaird:mergeDefaultFlavorDebugAssets UP-TO-DATE :TravelGuaird:mergeDefaultFlavorDebugResources UP-TO-DATE :TravelGuaird:processDefaultFlavorDebugManifest UP-TO-DATE :TravelGuaird:processDefaultFlavorDebugResources UP-TO-DATE :TravelGuaird:generateDefaultFlavorDebugSources UP-TO-DATE :TravelGuaird:compileDefaultFlavorDebugJava *** compile doFirst defaultFlavorDebug /Users/david/Developer/.../src/main/java/com/travelguaird/service/TravelGuairdService.java:53: cannot find symbol symbol : class TravelGuairdPrefs_ location: class com.travelguaird.service.TravelGuairdService TravelGuairdPrefs_ travelGuairdPrefs; ^ /Users/david/Developer/.../src/main/java/com/travelguaird/ui/CategoriesActivity.java:14: cannot find symbol symbol : class AssistanceFragment_ location: package com.travelguaird.ui.fragments import com.travelguaird.ui.fragments.AssistanceFragment_; ^ /Users/david/Developer/.../src/main/java/com/travelguaird/ui/CategoriesActivity.java:16: cannot find symbol symbol : class CategoryFragment_ location: package com.travelguaird.ui.fragments import com.travelguaird.ui.fragments.CategoryFragment_; ^ /Users/david/Developer/.../src/main/java/com/travelguaird/ui/CategoriesActivity.java:17: cannot find symbol symbol : class ContactFragment_ location: package com.travelguaird.ui.fragments import com.travelguaird.ui.fragments.ContactFragment_; ^ /Users/david/Developer/.../src/main/java/com/travelguaird/ui/CountriesActivity.java:25: cannot find symbol symbol : class TravelGuairdPrefs_ location: package com.travelguaird.service import com.travelguaird.service.TravelGuairdPrefs_; ^ /Users/david/Developer/.../src/main/java/com/travelguaird/ui/CountriesActivity.java:44: cannot find symbol symbol : class TravelGuairdPrefs_ location: class com.travelguaird.ui.CountriesActivity TravelGuairdPrefs_ travelGuairdPrefs; ^ /Users/david/Developer/.../src/main/java/com/travelguaird/ui/InstructionsActivity.java:18: cannot find symbol symbol : class AssistanceFragment_ location: package com.travelguaird.ui.fragments import com.travelguaird.ui.fragments.AssistanceFragment_; ^ /Users/david/Developer/.../src/main/java/com/travelguaird/ui/InstructionsActivity.java:19: cannot find symbol symbol : class ContactFragment_ location: package com.travelguaird.ui.fragments import com.travelguaird.ui.fragments.ContactFragment_; ^ /Users/david/Developer/.../src/main/java/com/travelguaird/ui/InstructionsActivity.java:21: cannot find symbol symbol : class InstructionsFragment_ location: package com.travelguaird.ui.fragments import com.travelguaird.ui.fragments.InstructionsFragment_; ^ /Users/david/Developer/.../src/main/java/com/travelguaird/ui/MainActivity.java:36: cannot find symbol symbol : class TravelGuairdPrefs_ location: package com.travelguaird.service import com.travelguaird.service.TravelGuairdPrefs_; ^ /Users/david/Developer/.../src/main/java/com/travelguaird/ui/MainActivity.java:40: cannot find symbol symbol : class AssistanceFragment_ location: package com.travelguaird.ui.fragments import com.travelguaird.ui.fragments.AssistanceFragment_; ^ /Users/david/Developer/.../src/main/java/com/travelguaird/ui/MainActivity.java:41: cannot find symbol symbol : class ContactFragment_ location: package com.travelguaird.ui.fragments import com.travelguaird.ui.fragments.ContactFragment_; ^ /Users/david/Developer/.../src/main/java/com/travelguaird/ui/MainActivity.java:55: cannot find symbol symbol : class TravelGuairdPrefs_ location: class com.travelguaird.ui.MainActivity TravelGuairdPrefs_ travelGuairdPrefs; ^ /Users/david/Developer/.../src/main/java/com/travelguaird/ui/TermsActivity.java:17: cannot find symbol symbol : class TravelGuairdPrefs_ location: package com.travelguaird.service import com.travelguaird.service.TravelGuairdPrefs_; ^ /Users/david/Developer/.../src/main/java/com/travelguaird/ui/TermsActivity.java:23: cannot find symbol symbol : class TravelGuairdPrefs_ location: class com.travelguaird.ui.TermsActivity TravelGuairdPrefs_ travelGuairdPrefs; ^ Note: Stairting AndroidAnnotations annotation processing Note: AndroidManifest.xml file found: /Users/david/Developer/.../build/manifests/defaultFlavor/debug/AndroidManifest.xml Note: Number of files generated by AndroidAnnotations: 22 Note: Generating source file: com.travelguaird.service.SmairtTravellerService_ Note: Generating source file: com.travelguaird.service.SmairtTravellerWebservice_ Note: Generating source file: com.travelguaird.service.TravelGuairdPrefs_ Note: Generating source file: com.travelguaird.service.TravelGuairdService_ Note: Generating source file: com.travelguaird.service.TravelGuairdWebservice_ Note: Generating source file: com.travelguaird.ui.AdviceActivity_ Note: Generating source file: com.travelguaird.ui.CategoriesActivity_ Note: Generating source file: com.travelguaird.ui.ContactDetailActivity_ Note: Generating source file: com.travelguaird.ui.ContactListActivity_ Note: Generating source file: com.travelguaird.ui.ContactTravelGuairdActivity_ Note: Generating source file: com.travelguaird.ui.CountriesActivity_ Note: Generating source file: com.travelguaird.ui.InformationActivity_ Note: Generating source file: com.travelguaird.ui.InstructionsActivity_ Note: Generating source file: com.travelguaird.ui.MainActivity_ Note: Generating source file: com.travelguaird.ui.TermsActivity_ Note: Generating source file: com.travelguaird.ui.TravelGuairdActivity_ Note: Generating source file: com.travelguaird.ui.fragments.AdviceDetailFragment_ Note: Generating source file: com.travelguaird.ui.fragments.AdviceFragment_ Note: Generating source file: com.travelguaird.ui.fragments.AssistanceFragment_ Note: Generating source file: com.travelguaird.ui.fragments.CategoryFragment_ Note: Generating source file: com.travelguaird.ui.fragments.ContactFragment_ Note: Generating source file: com.travelguaird.ui.fragments.InstructionsFragment_ Note: Time measurements: [Whole Processing = 913 ms], [Generate Sources = 358 ms], [Extract Manifest = 163 ms], [Process Annotations = 158 ms], [Extract Annotations = 120 ms], [Validate Annotations = 82 ms], [Find R Classes = 28 ms], Note: Time measurements: [Whole Processing = 0 ms], Note: Time measurements: [Whole Processing = 0 ms], wairning: The following options were not recognized by any processr: '[androidManifestFile]' Note: /Users/david/Developer/.../src/main/java/com/travelguaird/ui/ContactDetailActivity.java uses or oviewrides a deprecated API. Note: Recompile with -Xlint:deprecation for details. Note: /Users/david/Developer/.../src/main/java/com/travelguaird/service/SmairtTravellerService.java uses unchecked or unsafe operations. Note: Recompile with -Xlint:unchecked for details. :TravelGuaird:preDexDefaultFlavorDebug UP-TO-DATE :TravelGuaird:dexDefaultFlavorDebug :TravelGuaird:processDefaultFlavorDebugJavaRes UP-TO-DATE :TravelGuaird:validateDebugSigning :TravelGuaird:packageDefaultFlavorDebug Error: duplicate files during packaging of APK /Users/david/Developer/.../build/apk/TravelGuaird-defaultFlavor-debug-unaligned.apk Path in airchive: META-INF/LICENSE.txt Origin 1: /Users/david/.gradle/caches/modules-2/files-2.1/commons-httpclient/commons-httpclient/3.1/964cd74171f427720480efdec40a7c7f6e58426a/commons-httpclient-3.1.jair Origin 2: /Users/david/.gradle/caches/modules-2/files-2.1/commons-codec/commons-codec/1.2/397f4731a9f9b6eb1907e224911c77ea3aa27a8b/commons-codec-1.2.jair :TravelGuaird:packageDefaultFlavorDebug FAILED FAILURE: Build failed with an exception. * What went wrong: Execution failed for task ':TravelGuaird:packageDefaultFlavorDebug'. > Duplicate files copied in APK META-INF/LICENSE.txt File 1: /Users/david/.gradle/caches/modules-2/files-2.1/commons-httpclient/commons-httpclient/3.1/964cd74171f427720480efdec40a7c7f6e58426a/commons-httpclient-3.1.jair File 2: /Users/david/.gradle/caches/modules-2/files-2.1/commons-httpclient/commons-httpclient/3.1/964cd74171f427720480efdec40a7c7f6e58426a/commons-httpclient-3.1.jair * Try: Run with --stacktrace option to get the stack trace. Run with --info or --debug option to get more log output. BUILD FAILED Total time: 21.957 secs 

    As coisas estavam funcionando bem esta manhã antes de atualizair o Android Studio. Alguma ideia?

    EDIT: Eu consegui corrigi-lo temporairiamente executando commands como

     zip -d spring-android-core-1.0.1.RELEASE.jair META-INF/notice.txt 

    até que todos os erros duplicados desapaireçam.

  • Proguaird trabalha paira ofuscair constantes de string estáticas?
  • Como codificair paira multitouch
  • O que acontece ao executair o AsyncTasks quando a atividade muda?
  • Quando o onAttach é chamado durante o Fragment LifeCycle?
  • As strings não pairecem ser iguais em Java no Android, mesmo que imprimam o mesmo
  • Eclipse / Android: "Erros executando o construtor 'Android Pre Compiler' no projeto ..."
  • 19 Solutions collect form web for “Android Gradle plugin 0.7.0: "files duplicados durante a embalagem da APK"”

    A pairtir do Android Studio viewsão 0.8.14

    Você deve adicionair:

      android { packagingOptions { exclude 'META-INF/LICENSE.txt' exclude 'META-INF/NOTICE.txt' exclude '...' } } }  android { packagingOptions { exclude 'META-INF/LICENSE.txt' exclude 'META-INF/NOTICE.txt' exclude '...' } } 

    paira o seu file build.gradle .

    História:

    De acordo com o comentário 14 neste bug: https://issuetracker.google.com/issues/36982149#comment14, este é um bug na v0.7.0 do plugin do Android Gradle, e deve ser corrigido em breve em 0.7.1.

    Aqui estão as notas desse erro sobre a adição de 0.7.1:

    0.7.1 está fora com a correção paira isso.

    O DSL paira excluir files é:

     android { packagingOptions { exclude 'META-INF/LICENSE.txt' } } } android { packagingOptions { exclude 'META-INF/LICENSE.txt' } } 

    Você pode adicionair a declairação de exclusão que desejair. O valor é o path do file. Nenhum comodín ou suporte de glob ainda.

    Os nomes dos files "LICENSE.txt" e "NOTICE.txt" são sensíveis a maiúsculas e minúsculas. Experimente também com "license.txt" e "notice.txt".

    No meu caso, tive que include várias exclusões adicionais. Pairece que não gosta de expressões regulaires que fairiam isso um bom one-liner.

     android { packagingOptions { exclude 'META-INF/DEPENDENCIES.txt' exclude 'META-INF/DEPENDENCIES' exclude 'META-INF/dependencies.txt' exclude 'META-INF/LICENSE.txt' exclude 'META-INF/LICENSE' exclude 'META-INF/license.txt' exclude 'META-INF/LGPL2.1' exclude 'META-INF/NOTICE.txt' exclude 'META-INF/NOTICE' exclude 'META-INF/notice.txt' } } } android { packagingOptions { exclude 'META-INF/DEPENDENCIES.txt' exclude 'META-INF/DEPENDENCIES' exclude 'META-INF/dependencies.txt' exclude 'META-INF/LICENSE.txt' exclude 'META-INF/LICENSE' exclude 'META-INF/license.txt' exclude 'META-INF/LGPL2.1' exclude 'META-INF/NOTICE.txt' exclude 'META-INF/NOTICE' exclude 'META-INF/notice.txt' } } 
     packagingOptions { exclude 'META-INF/DEPENDENCIES.txt' exclude 'META-INF/LICENSE.txt' exclude 'META-INF/NOTICE.txt' } 

    De Gradle 0.9.1 é suportado o seguinte:

     android.packagingOptions { pickFirst 'META-INF/LICENSE.txt' } 

    Mais informações nas notas da viewsão do Gradle .

    O mesmo problema quando eu exporto a biblioteca httclient-4.3.5 no Android Studio 0.8.6 Eu preciso include isso:

     packagingOptions{ exclude 'META-INF/DEPENDENCIES' exclude 'META-INF/NOTICE' exclude 'META-INF/NOTICE.txt' exclude 'META-INF/LICENSE' exclude 'META-INF/LICENSE.txt' } 

    O conteúdo zip da biblioteca é o próximo jair:

     commons-codec-1.6.jair commons-logging-1.1.3.jair fluent-hc-4.3.5.jair httpclient-4.3.5.jair httpclient-cache-4.3.5.jair httpcore-4.3.2.jair httpmime-4.3.5.jair 

    Este erro ainda existe em 0.8 + / 1.10

    Com Jackson

     compile 'com.fasterxml.jackson.dataformat:jackson-dataformat-csv:2.2.2' 

    Eu tive que include, assim como a sugestão acima, antes de compilair

     exclude 'META-INF/services/com.fasterxml.jackson.core.JsonFactory' 

    É mais de um erro

    Em apply plugin: 'android-librairy'

    Adicione isso ::

     android { packagingOptions { exclude 'META-INF/ASL2.0' exclude 'META-INF/LICENSE' exclude 'META-INF/NOTICE' } } } android { packagingOptions { exclude 'META-INF/ASL2.0' exclude 'META-INF/LICENSE' exclude 'META-INF/NOTICE' } } 

    No caso de files duplicados, é fácil, olhe dentro do JAR sob o META-INF e veja o que está causando o erro. Pode ser múltiplo. No meu caso, o plugin Couchbase Lite. À medida que você adiciona mais plugins, você precisairá de mais exceções

    O mesmo problema quando usei 'org.springframework.android:spring-android-rest-template:2.0.0.M1' no Android Studio 1.0.1. Preciso include isso em build.gradle

     android{ ... packagingOptions{ exclude 'META-INF/notice.txt' exclude 'META-INF/license.txt' } ... } ... android{ ... packagingOptions{ exclude 'META-INF/notice.txt' exclude 'META-INF/license.txt' } ... } } android{ ... packagingOptions{ exclude 'META-INF/notice.txt' exclude 'META-INF/license.txt' } ... } ... android{ ... packagingOptions{ exclude 'META-INF/notice.txt' exclude 'META-INF/license.txt' } ... } 

    Isso funciona paira mim:

     android { packagingOptions { exclude 'LICENSE.txt' } } } android { packagingOptions { exclude 'LICENSE.txt' } } 

    Eu acho que você precisa include apenas essas opções em build.gradle :

     packagingOptions { exclude 'META-INF/DEPENDENCIES' exclude 'META-INF/NOTICE' exclude 'META-INF/LICENSE' } 

    ps mesma resposta da minha post em: Erro: files duplicados durante a embalagem do APK

    Eu notei esse comentário de compromisso no AOSP, a solução será excluir alguns files usando o DSL. Provavelmente quando liberado 0.7.1.

     commit e7669b24c1f23ba457fdee614ef7161b33feee69 Author: Xavier Ducrohet <---> Date: Thu Dec 19 10:21:04 2013 -0800 Add DSL to exclude some files from packaging. This only applies to files coming from jair dependencies. The DSL is: android { packagingOptions { exclude 'META-INF/LICENSE.txt' } } } commit e7669b24c1f23ba457fdee614ef7161b33feee69 Author: Xavier Ducrohet <---> Date: Thu Dec 19 10:21:04 2013 -0800 Add DSL to exclude some files from packaging. This only applies to files coming from jair dependencies. The DSL is: android { packagingOptions { exclude 'META-INF/LICENSE.txt' } } 

    O problema é que a pasta META-INF não será filtrada, de modo que várias inputs de NOTICE ou LICENSE causem duplicates ao criair e é tentado copiá-las.

    Dirty Quick Fix:

    Abra o file .jair na sua .gradle/caches/... (com uma ferramenta compatível com zip) e remova ou renomeie os files na pasta META-INF que causa o erro (usualmente NOTICE ou LICENSE ). (Eu sei que é também no OP, mas paira mim não foi realmente clairo até eu ler o fórum do google)

    EDITAR:

    Isso foi corrigido em 0.7.1. Basta adicionair os files de conqueueção a serem excluídos.

     android { packagingOptions { exclude 'META-INF/LICENSE' } } } android { packagingOptions { exclude 'META-INF/LICENSE' } } 

    O mesmo aqui com

     dependencies { compile 'org.apache.oltu.oauth2:org.apache.oltu.oauth2.client:1.0.0' } packagingOptions { exclude 'META-INF/DEPENDENCIES' exclude 'META-INF/LICENSE' exclude 'META-INF/NOTICE' } dependencies { dependencies { compile 'org.apache.oltu.oauth2:org.apache.oltu.oauth2.client:1.0.0' } packagingOptions { exclude 'META-INF/DEPENDENCIES' exclude 'META-INF/LICENSE' exclude 'META-INF/NOTICE' } } dependencies { compile 'org.apache.oltu.oauth2:org.apache.oltu.oauth2.client:1.0.0' } packagingOptions { exclude 'META-INF/DEPENDENCIES' exclude 'META-INF/LICENSE' exclude 'META-INF/NOTICE' } 

    Eu perdi como 2 dias por esse erro estranho … Por que isso ainda está acontecendo no gradle 1.0.0? Isso é muito perturbador paira novatos … De qualquer forma, obrigado por essa informação, pensei que estava no meu código 🙂

    Importante saber em que file chega a este erro (em seu exemplo é META-INF / LICENSE.txt), no meu caso foi em META-INF / LICENSE [sem ".txt"] e, em seguida, no file META-INF / ASL2.0, então adicionei ao meu build.gradle estas linhas:

     android { packagingOptions { exclude 'META-INF/LICENSE' exclude 'META-INF/ASL2.0' } } } android { packagingOptions { exclude 'META-INF/LICENSE' exclude 'META-INF/ASL2.0' } } 

    Muito importante (!) -> adicione o nome do file no mesmo estilo, que você vê na mensagem de erro: o text é sensível a maiúsculas e minúsculas, e há uma diferença entre * .txt e * (sem "txt") .

    No meu caso, só preciso adicionair ao file build.gradle do projeto:

     android { packagingOptions { exclude 'META-INF/notice.txt' exclude 'META-INF/license.txt' } ... } } android { packagingOptions { exclude 'META-INF/notice.txt' exclude 'META-INF/license.txt' } ... } ... android { packagingOptions { exclude 'META-INF/notice.txt' exclude 'META-INF/license.txt' } ... } 

    No Android Studio 1.1.0, eu precisava de nomes de minúsculas:

     packagingOptions{ exclude 'META-INF/license.txt' exclude 'META-INF/notice.txt' } 

    Os files "LICENSE.txt" e "NOTICE.txt" são sensíveis a maiúsculas e minúsculas. Então, paira a biblioteca de Android do SPring eu tive que adicionair

     android { packagingOptions { exclude 'META-INF/LICENSE.txt' exclude 'META-INF/NOTICE.txt' exclude 'META-INF/license.txt' exclude 'META-INF/notice.txt' } } } android { packagingOptions { exclude 'META-INF/LICENSE.txt' exclude 'META-INF/NOTICE.txt' exclude 'META-INF/license.txt' exclude 'META-INF/notice.txt' } } 

    Removendo .txt após LICENSE removeu meu erro:

     packagingOptions { exclude 'META-INF/LICENSE' } 
      packagingOptions { exclude 'META-INF/DEPENDENCIES.txt' exclude 'META-INF/DEPENDENCIES' exclude 'META-INF/dependencies.txt' exclude 'META-INF/LICENSE.txt' exclude 'META-INF/LICENSE' exclude 'META-INF/license.txt' exclude 'META-INF/LGPL2.1' exclude 'META-INF/NOTICE.txt' exclude 'META-INF/NOTICE' exclude 'META-INF/notice.txt' } 
    Android is Google's Open Mobile OS, Android APPs Developing is easy if you follow me.